{"text_format":"1","workbook":"xlsx","n_sheets":3,"sheets":["Pdiss","Control Loop","Constants"],"not_rendered":{"charts":11,"images":0,"macros":1,"external_links":0,"defined_names":118,"comments":0,"pivot_tables":0},"unopened":[],"bounds":{"document_bytes":16777216,"sheet_cells":100000,"rows_first":2000,"rows_last":500,"rows_between":2000,"halvings":0,"cell_chars":16384,"cell_head_chars":4096},"cells_cut":0,"cells_raw":0,"read":"whole","date_system":"1900"}

{"sheet":"Pdiss","index":0,"n_rows":183,"n_cols":67,"rows_kept":183,"cut":false,"hidden":false,"merged":[[76,4,76,6],[77,4,77,6],[78,4,78,6],[64,4,64,6],[65,4,65,6],[66,4,66,6],[67,4,67,6],[68,4,68,6],[73,4,73,6],[74,4,74,6],[91,4,91,6],[86,0,86,6],[25,5,25,6],[26,0,26,6],[85,0,85,6],[84,4,84,6],[69,0,69,6],[87,4,87,6],[88,4,88,6],[89,4,89,6],[79,4,79,6],[80,4,80,6],[81,4,81,6],[82,4,82,6],[83,4,83,6],[75,4,75,6],[0,0,0,6],[3,2,3,6],[29,4,29,6],[30,4,30,6],[31,4,31,6],[27,4,27,6],[28,0,28,6],[23,5,23,6],[24,5,24,6],[2,0,2,6],[20,5,20,6],[21,5,21,6],[22,5,22,6],[5,2,5,3],[4,2,4,3],[7,2,7,3],[90,2,90,3],[91,2,91,3],[25,1,25,3],[1,3,1,6],[12,2,12,3],[13,2,13,3],[14,2,14,3],[15,2,15,3],[16,2,16,3],[17,2,17,3],[18,2,18,3],[19,2,19,3],[90,4,90,6],[70,4,70,6],[71,4,71,6],[72,4,72,6],[61,4,61,6],[62,4,62,6],[63,0,63,6],[32,4,32,6],[33,4,33,6],[34,4,34,6],[50,4,50,6],[51,4,51,6],[52,4,52,6],[53,4,53,6],[47,4,47,6],[48,4,48,6],[49,4,49,6],[59,4,59,6],[57,0,57,6],[35,4,35,6],[36,4,36,6],[37,4,37,6],[38,0,38,6],[60,4,60,6],[54,4,54,6],[55,4,55,6],[56,4,56,6],[58,4,58,6],[42,4,42,6],[43,4,43,6],[44,4,44,6],[46,4,46,6],[45,0,45,6],[6,2,6,3],[8,2,8,3],[87,2,87,3],[88,2,88,3],[89,2,89,3],[20,0,20,3],[21,2,21,3],[22,2,22,3],[23,2,23,3],[24,1,24,3],[9,2,9,3],[10,2,10,3],[11,2,11,3]]}
["ALLEGRO A81407 DESIGN SPREADSHEET - Rev. 1.2",null,null,null,null,null,null,{"$f":"t_on_min_Boost*J19*10^-6","v":0.121},null,null,null,null,null,null,null,null,null,null,null,null,null,null,null,null,null,null,null,null,null,null,null,null,null,null,null,null,null,null,null,0]
[null,"Reset =  ",0,"If any cell gives an error, check for valid entries, then set \"RESET\" to \"1\" then back to \"0\"",null,null,null,"Buck","Vin",{"$f":"Vin_nom","v":13.5},{"$f":"Vin_min_bb","v":3.5},{"$f":"K2+(Vin_max_bb-Vin_min_bb)/49","v":3.795918367346939},4.091836734693878,4.387755102040817,4.683673469387756,4.979591836734695,5.275510204081634,5.571428571428573,5.8673469387755119,6.1632653061224509,6.4591836734693899,6.7551020408163289,7.0510204081632679,7.3469387755102069,7.6428571428571459,7.9387755102040849,8.2346938775510239,8.5306122448979629,8.8265306122449019,9.1224489795918409,9.4183673469387799,9.7142857142857189,10.010204081632658,10.306122448979597,10.602040816326536,10.897959183673475,11.193877551020414,11.489795918367353,11.785714285714292,12.081632653061231,12.37755102040817,12.673469387755109,12.969387755102048,{"$f":"AQ2+(Vin_max_bb-Vin_min_bb)/49","v":13.265306122448987},13.561224489795926,13.857142857142865,14.153061224489804,14.448979591836743,14.744897959183682,15.040816326530621,15.33673469387756,15.632653061224499,15.928571428571438,16.224489795918377,16.520408163265316,16.816326530612255,17.112244897959194,17.408163265306133,17.704081632653072,18.000000000000011,36,"Vin"]
["INSTRUCTIONS:   Enter design goals and component values in the white boxes.\nEnsure \"Iterative Calculation\" is enabled under File -> Options -> Formulas",null,null,null,null,null,null,"Buck-Boost","Pdiss total",{"$f":"J33+J36+J39+J42+J45+J21*Icc","v":0.95451733350131329},1.0923211727657882,1.0287573359083804,0.98235437963428418,0.94770217224883679,0.92141729979081199,0.90128673064482279,0.88579585004097616,0.87387654563576156,0.86481114562190231,0.85805225303192878,0.85318147137527667,0.84988060867224036,0.84327083370187017,0.8428147553469747,0.84328359023708133,0.84456432736007447,0.84347060013786213,0.84753268038128127,0.85188786113165671,0.85652673841956883,0.86144107447755602,0.86662362255138847,0.8720679823445785,0.87776848002893104,0.88372006808838877,0.88991824127677688,0.89635896574584761,0.90303861899853122,0.90995393878737996,0.91710197944208594,0.92448007439652402,{"$f":"AP33+AP36+AP39+AP42+AP45+AP21*Icc","v":0.93208580391284324},0.93991696718111595,0.94797155811810796,0.95624774430560699,0.96474384860340101,0.97345833304900664,0.98238978471921856,0.99153690328024036,1.0008984899957911,1.0104734379978688,1.0202607236541898,1.0302593988907844,1.0404685843487236,1.050887463271154,1.0566458579206308,1.0617814154407033,1.0669292841887079,1.0720888503235606,1.0772595401362788,1.4019241927137218,"Pdiss total","Buck-Boost"]
["Select Topology:","Buck-Boost","Select either Buck or Buck Boost operation",null,null,null,null,null,"Tj",{"$f":"IF(Reset=1,150,Ta+Rth_ja*J3)","v":153.63552000503941},157.76963518297364,155.86272007725142,154.47063138902854,153.43106516746511,152.64251899372437,152.03860191934467,151.57387550122928,151.21629636907284,150.94433436865708,150.74156759095786,150.5954441412583,150.49641826016722,150.2981250110561,150.28444266040924,150.29850770711244,150.33692982080223,150.30411800413586,150.42598041143845,150.55663583394971,150.69580215258708,150.84323223432668,150.99870867654164,151.16203947033736,151.33305440086792,151.51160204265167,151.69754723830331,151.89076897237544,152.09115856995595,152.2986181636214,152.51305938326257,152.73440223189573,{"$f":"IF(Reset=1,150,Ta+Rth_ja*AP3)","v":152.96257411738529},153.19750901543347,153.43914674354323,153.68743232916822,153.94231545810203,154.2037499914702,154.47169354157654,154.74610709840721,155.02695469987373,155.31420313993607,155.60782170962568,155.90778196672352,156.2140575304617,156.52662389813463,156.69937573761894,156.85344246322109,157.00787852566123,157.16266550970681,157.31778620408835,167.05772578141165,"Tj"]
["VARIABLES","MIN","TYP",null,"MAX","UNITS","COMMENTS","Yes",null,null,{"$f":"K2","v":3.5},{"$f":"L2","v":3.795918367346939},4.091836734693878,4.387755102040817,4.683673469387756,4.979591836734695,5.275510204081634,5.571428571428573,5.8673469387755119,6.1632653061224509,6.4591836734693899,6.7551020408163289,7.0510204081632679,7.3469387755102069,7.6428571428571459,7.9387755102040849,8.2346938775510239,8.5306122448979629,8.8265306122449019,9.1224489795918409,9.4183673469387799,9.7142857142857189,10.010204081632658,10.306122448979597,10.602040816326536,10.897959183673475,11.193877551020414,11.489795918367353,11.785714285714292,12.081632653061231,12.37755102040817,12.673469387755109,12.969387755102048,13.265306122448987,13.561224489795926,13.857142857142865,14.153061224489804,14.448979591836743,14.744897959183682,15.040816326530621,15.33673469387756,15.632653061224499,15.928571428571438,16.224489795918377,16.520408163265316,16.816326530612255,17.112244897959194,17.408163265306133,17.704081632653072,18.000000000000011,{"$f":"BI2","v":36}]
["Vin Buck Boost",3.5,13.5,null,18,"V",null,"No"]
["Boost Input Current",{"$f":"(K61+K62)/K2","v":1.3471054043935609},{"$f":"(J61+J62)/Vin_nom","v":0.31435218016756328},null,{"$f":"(BH61+BH62)/BH2","v":0.24336905515243545},"A"]
["Vin Buck",6.5,"‒",null,18,"V",null,"Buck Boost Mode Calculations",null,{"$f":"IF(J14>J12,\"Boost >\",\"buck >\")","v":"buck >"},"buck >","buck >","buck >","buck >","buck >","buck >","buck >","buck >","buck >","buck >","buck >","buck >","buck >","buck >","buck >","buck >","buck >","buck >","buck >","buck >","buck >","buck >","buck >","buck >","buck >","buck >","buck >","buck >","buck >","buck >","buck >",{"$f":"IF(AP14>AP12,\"Boost >\",\"buck >\")","v":"buck >"},"buck >","buck >","buck >","buck >","buck >","buck >","buck >","buck >","buck >","buck >","buck >","buck >","buck >","buck >","buck >","buck >","buck >","buck >","buck >",null,"Buck Boost Mode Calculations"]
["Buck Input Current",{"$f":"(K111+K112)/K65","v":0.60224728279068562},{"$f":"(J111+J112)/Vin_nom","v":0.30359500415177892},null,{"$f":"(BH111+BH112)/BH65","v":0.23686039720772603},"A","Buck is a tiny bit more efficient - no losses due to removal of the boost diode",null,"V1",{"$f":"IF(Reset=1,J2-Vreg,IF(J14=0,J2-(J22-J23/2)*(J30+dcr*10^-3)-J21-J52,J2-(J22-J23/2)*(J30+R_ds_ON_boost+dcr*10^-3)))","v":7.7567323589252855},{"$f":"IF(Reset=1,K2,IF(K14=0,K2-(K22-K23/2)*(K30+dcr*10^-3)-K21-K52,K2-(K22-K23/2)*(K30+R_ds_ON_boost+dcr*10^-3)))","v":3.0557201983427333},3.3916064300389448,3.7209959648952737,4.0453646173821456,4.3657559187919359,4.6829314805880431,4.9974600333136703,5.3097753903979692,5.6202221273389252,5.9290705187500299,6.2365361760509703,6.5427941701575749,6.857774622739039,7.1616196044487639,7.4646598933371902,7.7669753269924948,2.4924256570765806,2.7883074657013278,3.0841866364215136,3.3800632538728621,3.6759373921952783,3.9718091166095526,4.2676784847183526,4.5635455475861342,4.8594103506405375,5.1552729344287815,5.4511333352554985,5.7469915857231637,6.0428477151920017,6.3387017501730494,6.6345537146653975,6.9304036304466905,{"$f":"IF(Reset=1,AQ2,IF(AQ14=0,AQ2-(AQ22-AQ23/2)*(AQ30+dcr*10^-3)-AQ21-AQ52,AQ2-(AQ22-AQ23/2)*(AQ30+R_ds_ON_boost+dcr*10^-3)))","v":7.226251517324215},7.5220973933527198,7.8179412750239727,8.1137831774322304,8.4096231144191602,8.7054610987010665,9.001297141980956,9.2971312550474554,9.5929634478623758,9.8887937296384081,10.184622108908217,10.480448593586036,10.776273191022671,11.072139732817767,11.368011880147023,11.663883916675232,11.959755847926957,12.255627679065579,30.252705697192372,"V1"]
["VREG","‒",5.35,null,"‒","V",null,null,"V2",{"$f":"IF(Reset=1,0,IF(J12>J14,IF(J14=0,0,Vreg+J48+(J22-J23/2)*(J30+dcr*10^-3)-J2),J48+(J22-J23/2)*(R_ds_ON_boost+dcr*10^-3)))","v":0},{"$f":"IF(Reset=1,K48,IF(K12>K14,IF(K14=0,0,Vreg+K48+(K22-K23/2)*(K30+dcr*10^-3)-K2),K48+(K22-K23/2)*(R_ds_ON_boost+dcr*10^-3)))","v":2.5363266481235591},2.2001592983616609,1.8706454947909963,1.546240058871021,1.2258612173648222,0.90872549918974777,0.5935517142782949,0.27916320235154135,-3.3122528744867985E-2,-0.34360894932846886,-0.65253922354800586,-0.96011056837657627,-1.2762865872131073,-1.5811914847985324,-1.8851859859614581,-2.1883602550303882,0,0,0,0,0,0,0,0,0,0,0,0,0,0,0,0,{"$f":"IF(Reset=1,AQ48,IF(AQ12>AQ14,IF(AQ14=0,0,Vreg+AQ48+(AQ22-AQ23/2)*(AQ30+dcr*10^-3)-AQ2),AQ48+(AQ22-AQ23/2)*(R_ds_ON_boost+dcr*10^-3)))","v":0},0,0,0,0,0,0,0,0,0,0,0,0,0,0,0,0,0,0,"V2"]
["I out ext","‒","‒",null,0,"A","External load applied directly to VREG output","ton min (LG)","V3",{"$f":"IF(Reset=1,Vreg,Vreg+J48+J52+(J22-J23/2)*dcr*10^-3)","v":5.8736924474442782},{"$f":"Vreg+K48+K52+(K22-K23/2)*dcr*10^-3","v":6.0214311318399094},6.0058904701336635,5.9928412997611629,5.9817191779058847,5.9721236266883855,5.9637615829888615,5.9557142058766726,5.9460473853157998,5.936440999478342,5.9278274358671101,5.9200710230148141,5.9130611985662442,5.9066970269517629,5.9009231008767316,5.8956655317881674,5.890870743571913,5.8774106102446533,5.8770771905793984,5.8767666029035759,5.8764765815689675,5.8762051508589597,5.8759505800829102,5.8757113467600801,5.8754861062436392,5.8752736665084981,5.8750729671076547,5.8748830615149892,5.8747031022356673,5.8745323281911714,5.8743700539838537,5.8742156607223359,5.8740685881494032,{"$f":"Vreg+AQ48+AQ52+(AQ22-AQ23/2)*dcr*10^-3","v":5.8739283278617282},5.8737944174488117,5.873666435409028,5.8735439967252008,5.8734267490020402,5.873314369083956,5.8732065600849763,5.8731030487733795,5.8730035832625909,5.8729079309673216,5.8728158767900727,5.8727272215082893,5.8726417803367248,5.8725593696535814,5.8724798406761138,5.8724030463460721,5.8723288480299116,5.8722571163071251,5.870123664992013,"V3"]
["VUC Select","‒","‒",null,3.3,"V","Select VUC output voltage from pull-down menu",55,"Buck duty",{"$f":"IF(Reset=1,0.7,IF(J14=0,IF(J11/(J9+J11)>1,1,J11/(J9+J11)),IF(IF((J11*(1-J14)+J10*J14)/(J9+J10)>J14,(J10*J14-J11+J9*J14)/(J10-J11),(J11*(1-J14)+J10*J14)/(J9+J10))>$B$183,$B$183,IF((J11*(1-J14)+J10*J14)/(J9+J10)>J14,(J10*J14-J11+J9*J14)/(J10-J11),(J11*(1-J14)+J10*J14)/(J9+J10)))))","v":0.43092512015469048},{"$f":"IF(Reset=1,0.7,IF(K14=0,IF(K11/(K9+K11)>1,1,K11/(K9+K11)),IF(IF((K11*(1-K14)+K10*K14)/(K9+K10)>K14,(K10*K14-K11+K9*K14)/(K10-K11),(K11*(1-K14)+K10*K14)/(K9+K10))>$B$183,$B$183,IF((K11*(1-K14)+K10*K14)/(K9+K10)>K14,(K10*K14-K11+K9*K14)/(K10-K11),(K11*(1-K14)+K10*K14)/(K9+K10)))))","v":0.70976009143593222},0.69584803386893934,0.68536690107320042,0.67728750645930791,0.6709431268599495,0.66588472722969805,0.66172609872724752,0.65810370110846783,0.65504733625193901,0.65249768627198068,0.6503570660022111,0.64855020079314452,0.64613540767142408,0.64490405271617068,0.64385492142496326,0.64295959649416545,0.70221333160268851,0.67822461710567639,0.65581935827021409,0.63484592364296499,0.61517142613536413,0.59667891592200883,0.57926506270376432,0.5628382306981603,0.5473168709132511,0.53262817136943152,0.51870691827624049,0.50549453070062256,0.49293823867376446,0.4809903804859661,0.46960779949148707,{"$f":"IF(Reset=1,0.7,IF(AP14=0,IF(AP11/(AP9+AP11)>1,1,AP11/(AP9+AP11)),IF(IF((AP11*(1-AP14)+AP10*AP14)/(AP9+AP10)>AP14,(AP10*AP14-AP11+AP9*AP14)/(AP10-AP11),(AP11*(1-AP14)+AP10*AP14)/(AP9+AP10))>$B$183,$B$183,IF((AP11*(1-AP14)+AP10*AP14)/(AP9+AP10)>AP14,(AP10*AP14-AP11+AP9*AP14)/(AP10-AP11),(AP11*(1-AP14)+AP10*AP14)/(AP9+AP10)))))","v":0.45875132437074767},0.44838531968859041,0.43847729590594225,0.4289975698714546,0.4199189683342065,0.41121656825156427,0.40286746867474038,0.39485058982298959,0.38714649564075337,0.37973723669805337,0.37260621076503886,0.36573803878431616,0.35911845429360811,0.35273420462770372,0.34657206564364906,0.34062136601262416,0.33487151862473419,0.32931252560511703,0.32393504165505665,0.16250453712070578,"Buck duty"]
["Iout VUC","‒","‒",null,0.25,"A","Enter VUC operating current. Maximum current is 0.375A","Min Boost Duty",null,{"$f":"IF(m_*J2+b_<0,0,m_*J2+b_)","v":0},{"$f":"IF(m_*K2+b_<0,0,m_*K2+b_)","v":0.63444444444444448},{"$f":"IF(m_*L2+b_<0,0,m_*L2+b_)","v":0.60046863189720334},0.56649281934996221,0.53251700680272107,0.49854119425547994,0.4645653817082388,0.43058956916099766,0.39661375661375653,0.36263794406651539,0.32866213151927426,0.29468631897203312,0.26071050642479199,0.22673469387755085,0.19275888133030961,0.15878306878306847,0.12480725623582734,9.08314436885862E-2,5.6855631141345064E-2,2.2879818594103929E-2,0,0,0,0,0,0,0,0,0,0,0,0,{"$f":"IF(m_*AP2+b_<0,0,m_*AP2+b_)","v":0},0,0,0,0,0,0,0,0,0,0,0,0,0,0,0,0,0,0,{"$f":"IF(m_*BI2+b_<0,0,m_*BI2+b_)","v":0}]
["Iout V5A","‒","‒",null,0.1,"A","Enter V5A operating current. Maximum current is 0.150A",0.121,"Boost duty",{"$f":"IF(J13<D_boost_min,0,J13)","v":0},{"$f":"IF(K13<D_boost_min,0,K13)","v":0.63444444444444448},{"$f":"IF(L13<D_boost_min,0,L13)","v":0.60046863189720334},{"$f":"IF(M13<D_boost_min,0,M13)","v":0.56649281934996221},0.53251700680272107,0.49854119425547994,0.4645653817082388,0.43058956916099766,0.39661375661375653,0.36263794406651539,0.32866213151927426,0.29468631897203312,0.26071050642479199,0.22673469387755085,0.19275888133030961,0.15878306878306847,0.12480725623582734,0,0,0,0,0,0,0,0,0,0,0,0,0,0,0,{"$f":"IF(AP13<D_boost_min,0,AP13)","v":0},0,0,0,0,0,0,0,0,0,0,0,0,0,0,0,0,0,0,0,"Boost duty"]
["Iout V5P1","‒","‒",null,0.1,"A","Enter V5P1 operating current. Maximum current is 0.120A",null,"ton buck",{"$f":"IF(J12>1,1000/fsw,IF(J12*1000/fsw<0.16,0.16,J12*1000/fsw))","v":0.1958750546157684},0.32261822337996915,0.31629456084951785,0.31153040957872746,0.30785795748150357,0.30497414857270433,0.30267487601349907,0.30078459033056704,0.29913804595839444,0.2977487892054268,0.29658985739635485,0.29561684818282324,0.29479554581506567,0.29369791257792005,0.2931382057800776,0.29266132792043781,0.29225436204280247,0.31918787800122206,0.30828391686621653,0.29809970830464277,0.28856632892862044,0.27962337551607463,0.27121768905545857,0.26330230122898379,0.25583555940825464,0.24878039586965961,0.24210371425883248,0.23577587194374566,0.22977024122755571,0.22406283576080205,0.2186319911299846,0.21345809067794866,{"$f":"IF(AP12>1,1000/fsw,IF(AP12*1000/fsw<0.16,0.16,AP12*1000/fsw))","v":0.20852332925943076},0.20381150894935929,0.19930786177542828,0.1949988953961157,0.19087225833373023,0.18691662193252923,0.18312157667033654,0.17947754082863163,0.17597567983670606,0.17260783486275152,0.16936645943865403,0.16624456308378005,0.16323566104254914,0.16033372937622897,0.16,0.16,0.16,0.16,0.16,0.16,"ton buck"]
["Iout V5P2","‒","‒",null,0.1,"A","Enter V5P2 operating current. Maximum current is 0.120A",3.3,"toff buck",{"$f":"J15/J12-J15","v":0.2586703999296861},0.13192723116548533,0.13825089369593663,0.14301504496672707,0.14668749706395096,0.14957130597275026,0.1518705785319554,0.15376086421488749,0.15540740858706004,0.15679666534002773,0.15795559714909968,0.15892860636263134,0.15974990873038886,0.16084754196753454,0.16140724876537699,0.16188412662501667,0.16229109250265206,0.13535757654423253,0.146261537679238,0.15644574624081176,0.16597912561683409,0.17492207902937995,0.18332776548999596,0.19124315331647079,0.19870989513719983,0.20576505867579498,0.21244174028662199,0.21876958260170887,0.22477521331789882,0.23048261878465254,0.23591346341546998,0.24108736386750587,{"$f":"AP15/AP12-AP15","v":0.24602212528602377},0.2507339455960953,0.25523759277002622,0.25954655914933877,0.2636731962117243,0.26762883261292536,0.27142387787511801,0.27506791371682293,0.27856977470874844,0.28193761968270303,0.2851789951068005,0.28830089146167442,0.29130979350290542,0.29421172516922561,0.30166444402508352,0.30972978199514956,0.31779518741126567,0.32586065685171695,0.33392618712234456,0.82458789419002221,"toff buck"]
["VREG_Iout_Max","‒","‒",null,{"$f":"I_reg_ext+Iout_VUC+Iout_V5C+Iout_V5P1+Iout_V5P2+Icc","v":0.56999999999999995},"A","VREG maximum output current",5,"ton boost",{"$f":"J14/(fsw*10^-3)","v":0},0.28838383838383835,0.2729402872260015,0.25749673606816464,0.24205318491032773,0.22660963375249085,0.21116608259465397,0.19572253143681712,0.18027898027898023,0.16483542912114335,0.14939187796330647,0.13394832680546959,0.11850477564763272,0.10306122448979584,8.7617673331958898E-2,7.217412217412203E-2,5.6730571016285147E-2,0,0,0,0,0,0,0,0,0,0,0,0,0,0,0,{"$f":"AP14/(fsw*10^-3)","v":0},0,0,0,0,0,0,0,0,0,0,0,0,0,0,0,0,0,0,0,"ton boost"]
["Lo_tolerance",-25,"‒",null,25,"%","Output inductor tolerances",2200,"toff boost",{"$f":"1/fsw*10^3-J17","v":0.45454545454545453},0.16616161616161618,0.18160516731945303,0.19704871847728989,0.2124922696351268,0.22793582079296368,0.24337937195080056,0.25882292310863741,0.27426647426647432,0.28971002542431118,0.30515357658214803,0.32059712773998494,0.3360406788978218,0.35148423005565871,0.36692778121349562,0.38237133237133247,0.39781488352916938,0.45454545454545453,0.45454545454545453,0.45454545454545453,0.45454545454545453,0.45454545454545453,0.45454545454545453,0.45454545454545453,0.45454545454545453,0.45454545454545453,0.45454545454545453,0.45454545454545453,0.45454545454545453,0.45454545454545453,0.45454545454545453,0.45454545454545453,{"$f":"1/fsw*10^3-AP17","v":0.45454545454545453},0.45454545454545453,0.45454545454545453,0.45454545454545453,0.45454545454545453,0.45454545454545453,0.45454545454545453,0.45454545454545453,0.45454545454545453,0.45454545454545453,0.45454545454545453,0.45454545454545453,0.45454545454545453,0.45454545454545453,0.45454545454545453,0.45454545454545453,0.45454545454545453,0.45454545454545453,0.45454545454545453,0.45454545454545453,"toff boost"]
["RθJA","‒",30,null,"‒","°C/W","Thermal resistance of the PMIC, mounted on a 4 layer PCB",null,"fsw",{"$f":"1/(J15+J16)*10^3","v":2200},2200,2200,2200,2200,2199.9999999999995,2200,2200,2200,2200,2200,2199.9999999999995,2200,2199.9999999999995,2199.9999999999995,2200,2200,2199.9999999999995,2200,2200,2200,2199.9999999999995,2200,2199.9999999999995,2200,2199.9999999999995,2200,2200,2200,2199.9999999999995,2199.9999999999995,2200,{"$f":"1/(AP15+AP16)*10^3","v":2200},2199.9999999999995,2200,2200,2200,2199.9999999999995,2199.9999999999995,2199.9999999999995,2200,2199.9999999999995,2200,2200,2199.9999999999995,2199.9999999999995,2166.0754102728065,2128.8835375789008,2092.9469914045881,2058.2032850319811,2024.5940103441042,1015.6533570044111,"fsw"]
["TAMB","‒","‒",null,125,"°C","Maximum steady-state ambient temperature",null,"V out buck",null,null,null,null,null,null,null,null,null,null,null,null,null,null,null,null,null,null,null,null,null,null,null,null,null,null,null,null,null,null,null,null,null,null,null,null,null,null,null,null,null,null,null,null,null,null,null,null,null,null,null,null,"V out buck",null,null,"buck",null,0.54]
["DIODE CHARACTERIZATION",null,null,null,"UNITS","COMMENTS",null,null,"VREG",{"$f":"IF(J14>0,IF(J12/(1-J14)*J9>Vreg,Vreg,J12/(1-J14)*J9),IF(J12*(J9+J11)>Vreg,Vreg,J12*(J9+J11)))","v":5.35},5.35,5.35,5.35,5.35,5.35,5.35,5.35,5.35,5.35,5.35,5.35,5.35,5.35,5.35,5.35,5.35,5.35,5.35,5.35,5.35,5.35,5.35,5.35,5.35,5.35,5.35,5.35,5.35,5.35,5.35,5.35,{"$f":"IF(AP14>0,IF(AP12/(1-AP14)*AP9>Vreg,Vreg,AP12/(1-AP14)*AP9),IF(AP12*(AP9+AP11)>Vreg,Vreg,AP12*(AP9+AP11)))","v":5.35},5.35,5.35,5.35,5.35,5.35,5.35,5.35,5.35,5.35,5.35,5.35,5.35,5.35,5.35,5.35,5.35,5.35,5.35,5.35,"VREG",null,null,"Boost duty",0.54,0]
["VF1",0.2,0.34,null,"A   |   VF","Value from the data sheet for D1: VF at 200mA",null,"Circuit Currents","Ilpk",{"$f":"IF(J14=0,Iout_PreReg+J23/2,IF(J$12>J$14,(Iout_PreReg+J23/2*(1-J12))/(1-J14),Iout_PreReg/(1-J14)+J23/2))","v":0.64596751872221936},{"$f":"IF(K14=0,Iout_PreReg+K23/2,IF(K$12>K$14,(Iout_PreReg+K23/2*(1-K12))/(1-K14),Iout_PreReg/(1-K14)+K23/2))","v":1.59425361315285},1.4619071545645423,1.3496274615081689,1.2530934933417057,1.169143226186556,1.0954090632705733,1.0300892221475091,0.97178857216009185,0.91938075725943691,0.87197538336572644,0.82885691757020319,0.78944023491504733,0.75330556121251213,0.71990988289088709,0.68899439666678508,0.66027289363608654,0.60977760282790372,0.61297951734768585,0.61596975683371646,0.61876862223583096,0.62139390108956993,0.6238612444988122,0.62618447829658819,0.62837586140258739,0.63044630153627368,0.63240553627216189,0.63426228576007415,0.63602438214921719,0.63769887975683015,0.63929214924097255,0.64080995842163835,{"$f":"IF(AP14=0,Iout_PreReg+AP23/2,IF(AP$12>AP$14,(Iout_PreReg+AP23/2*(1-AP12))/(1-AP14),Iout_PreReg/(1-AP14)+AP23/2))","v":0.64225754190661943},0.6436396612896722,0.64496065737678265,0.64622449564506868,0.64743480593533587,0.64859491721364726,0.6497078881018209,0.65077653376552658,0.65180344965690318,0.65279103253265203,0.65374149910540091,0.65465690263344256,0.65553914770982358,0.65639000347468701,0.65857711786254214,0.66094409504117613,0.66331107133340184,0.66567804678341558,0.66804502143252464,0.81202164557753898,"Ilpk","Circuit Currents",null,"Ipk",1.734,0.9]
["VF2",1,0.4,null,"A   |   VF","Value from the data sheet for D1: VF at 2A",null,null,"ΔIL",{"$f":"IF(J$12>J$14,IF(J14=0,J9*J12/(L_buck*10^-6*J19*10^3),(J9*(J14)/(L_buck*10^-6*J19*10^3))),J9*(J12)/(L_buck*10^-6*J19*10^3))","v":0.15193503744443884},8.8122031982510132E-2,9.2570603317238334E-2,9.5814431588334387E-2,9.7919338976089773E-2,9.8932234981020994E-2,9.8887629581496009E-2,9.7811552847447192E-2,9.5724089289137018E-2,9.2641172611605691E-2,8.8575497937294273E-2,8.3537358584380925E-2,7.7535235524316279E-2,7.0677064989453323E-2,6.2748444703034478E-2,5.3875527512998712E-2,4.4062494536968227E-2,7.9555205655807537E-2,8.5959034695371903E-2,9.193951366743304E-2,9.7537244471661955E-2,0.10278780217914005,0.10772248899762453,0.11236895659317649,0.11675172280517486,0.12089260307254743,0.12481107254432387,0.12852457152014837,0.13204876429843443,0.13539775951366034,0.13858429848194523,0.14161991684327677,{"$f":"IF(AP$12>AP$14,IF(AP14=0,AP9*AP12/(L_buck*10^-6*AP19*10^3),(AP9*(AP14)/(L_buck*10^-6*AP19*10^3))),AP9*(AP12)/(L_buck*10^-6*AP19*10^3))","v":0.14451508381323894},0.14727932257934456,0.14992131475356535,0.15244899129013753,0.15486961187067191,0.15718983442729453,0.15941577620364197,0.16155306753105325,0.16360689931380643,0.16558206506530407,0.16748299821080195,0.16931380526688533,0.17107829541964714,0.17278000694937404,0.17715423572508429,0.18188819008235241,0.1866221426668038,0.19135609356683136,0.1960900428650493,0.48404329115507805,"ΔIL",null,null,"DI",0.17799999999999999,0.252]
["VF3",4,0.51,null,"A   |   VF","Value from the data sheet for D1: VF at 4A",null,null,"IL RMS",{"$f":"IF(J12>J14,SQRT((J22-J23/2)^2+J23^2/12+(J12-J14)*J23^2/12),SQRT((J22-J23/2)^2+J23^2/12+(J14-J12)*J23^2/12))","v":0.57240951550024854},1.5504170249524658,1.4158981077390593,1.3020489908464532,1.2045135765800992,1.1201040472097636,1.0464331094181394,0.9816834968597441,0.92444766838887393,0.87358937258187774,0.82821032708931064,0.78758889832392098,0.75113557538461784,0.71837838855991343,0.68888157539011941,0.66232786133667665,0.63843404043698604,0.5707869830705643,0.57090573705731085,0.57102221444596946,0.57113579308245366,0.57124606656568044,0.57135278631147057,0.57145581896211251,0.57155511493324951,0.57165068509982109,0.5717425834672315,0.57183089426866507,0.57191572235196642,0.57199718602208505,0.57207541172340626,0.57215053010494776,{"$f":"IF(AP12>AP14,SQRT((AP22-AP23/2)^2+AP23^2/12+(AP12-AP14)*AP23^2/12),SQRT((AP22-AP23/2)^2+AP23^2/12+(AP14-AP12)*AP23^2/12))","v":0.57222267312745001},0.57229197195680082,0.57235855545146619,0.57242254909864387,0.57248407428905523,0.57254324784672761,0.57260018175006899,0.57265498299565198,0.57270775356760628,0.57275859048428213,0.57280758590054026,0.57285482724916104,0.57290039740880783,0.57294437488900785,0.57308087782669559,0.57323295127964302,0.57338836972941998,0.5735471240584693,0.57370920551913707,0.58957416700200993,"IL RMS",null,null,"IC rms",{"$f":"SQRT(((BN22-BN23/2-Iout_PreReg)^2+BN23^2/12)*(1-BN21)+Iout_PreReg^2*BN21)","v":0.84157474613567951},{"$f":"SQRT(((BO22-BO23/2-Iout_PreReg)^2+BO23^2/12)*(1-BO21)+Iout_PreReg^2*BO21)","v":0.21658254777336061}]
["VF, Temp. Coeff.",-1,null,null,"mV/°C","Estimated value from the data sheet for D1",null,null,"Isw buck RMS",{"$f":"IF(J12>J14,SQRT(J12*(J22-J23/2)^2+J14*J23^2/12),SQRT(J12*(J22-J23/2)^2+J12*J23^2/12))","v":0.37417585643418916},1.3061519718559109,1.1810579930630025,1.0778547563355929,0.99118644177413229,0.91736169374748688,0.85374779530625933,0.79837389253310964,0.74972437910593237,0.70679470162371405,0.66874464102262143,0.63488007449032646,0.6046443004498474,0.57720195874663727,0.55299207460082156,0.53127416874536082,0.51179226938592415,0.47764956970326422,0.46942004441399204,0.46160124512612888,0.45416014861676196,0.44706732865574039,0.44029646805653649,0.43382394916884548,0.42762850835021776,0.42169094294247683,0.41599386158683677,0.41052147050787796,0.40525938980439707,0.4001944948960518,0.39531477915692753,0.39060923447197732,{"$f":"IF(AP12>AP14,SQRT(AP12*(AP22-AP23/2)^2+AP14*AP23^2/12),SQRT(AP12*(AP22-AP23/2)^2+AP12*AP23^2/12))","v":0.38606774701864943},0.38168100603360261,0.37744042369603265,0.37333806456244933,0.36936658323646937,0.3655191691620745,0.3617894975982901,0.35817168597404414,0.35466025493940079,0.35125009352767089,0.34793642792550639,0.34471479341772415,0.34158100913252382,0.33853115526276295,0.33556111831918423,0.33266782504098824,0.32984808079049988,0.32709882232912801,0.3244171620517754,0.22977755353932486,"Isw buck RMS",null,null,null,null,{"$f":"SQRT(BO20/3*BO23^2)","v":0.10691454531540599}]
["RθJA",85,null,null,"°C/W",null,null,null,"I buck Diode avg",{"$f":"IF(J$12>J$14,(J22-J23/2)*(1-J12),J22*(J14-J12)+(J22-J23/2)*(1-J14))","v":0.32437268151182641},0.44992775765687604,0.43056416985943169,0.40956427484475139,0.38858902885250335,0.36843744831401321,0.34947296430409347,0.33190875204922687,0.31588706020526275,0.3011644315827936,0.28762336799705601,0.27519984094667516,0.26382374056846764,0.25406310992257813,0.24449622261792467,0.23578821154895796,0.22787805495331692,0.16973840098646753,0.18341196824976444,0.19618296578597796,0.20813782352350993,0.21935228710284244,0.22989301792445493,0.23981891425885432,0.24918220850204861,0.25802938357944688,0.26640194231942399,0.27433705658254287,0.28186811750064511,0.28902520395595427,0.29583548312299929,0.3023235542898523,{"$f":"IF(AP$12>AP$14,(AP22-AP23/2)*(1-AP12),AP22*(AP14-AP12)+(AP22-AP23/2)*(1-AP14))","v":0.3085117451086738},0.31442036777750343,0.32006794133361294,0.3254713851732709,0.33064618804950224,0.33560655609660833,0.34036554285539794,0.34493516380089589,0.34932649748477057,0.35354977508210955,0.35761445986392781,0.36152931789293974,0.3653024810526434,0.36894150336220882,0.37245392258311999,0.3758458213728042,0.3791232343839015,0.38229186040508317,0.38535702625661772,0.47737241384119766,"I buck Diode avg"]
["COMPONENT CALCULATIONS and VALUE ENTRY",null,null,null,null,null,null,null,"I boost SW RMS",{"$f":"IF(J12>J14,SQRT(J14*(J22-J23/2)^2+J14*J23^2/12),SQRT(J14*(J22-J23/2)^2+J12*J23^2/12))","v":0},1.2349259741356222,1.097159546346792,0.97997022660307553,0.87894384072775589,0.79083257974858179,0.71318526110353198,0.6441124839596446,0.58212396336437067,0.52599843292545401,0.47473192557038163,0.42747148821597075,0.38346241676823889,0.34200997706590019,0.30240145285157033,0.26388641531244356,0.22552323177361056,0,0,0,0,0,0,0,0,0,0,0,0,0,0,0,{"$f":"IF(AP12>AP14,SQRT(AP14*(AP22-AP23/2)^2+AP14*AP23^2/12),SQRT(AP14*(AP22-AP23/2)^2+AP12*AP23^2/12))","v":0},0,0,0,0,0,0,0,0,0,0,0,0,0,0,0,0,0,0,0,"I boost SW RMS"]
["COMPONENT","VALUE","UNITS",null,"COMMENTS",null,null,null,"I boost Diode avg",{"$f":"Iout_PreReg","v":0.56999999999999995},0.56999999999999995,0.56999999999999995,0.56999999999999995,0.56999999999999995,0.56999999999999995,0.56999999999999995,0.56999999999999995,0.56999999999999995,0.56999999999999995,0.56999999999999995,0.56999999999999995,0.56999999999999995,0.56999999999999995,0.56999999999999995,0.56999999999999995,0.56999999999999995,0.56999999999999995,0.56999999999999995,0.56999999999999995,0.56999999999999995,0.56999999999999995,0.56999999999999995,0.56999999999999995,0.56999999999999995,0.56999999999999995,0.56999999999999995,0.56999999999999995,0.56999999999999995,0.56999999999999995,0.56999999999999995,0.56999999999999995,{"$f":"Iout_PreReg","v":0.56999999999999995},0.56999999999999995,0.56999999999999995,0.56999999999999995,0.56999999999999995,0.56999999999999995,0.56999999999999995,0.56999999999999995,0.56999999999999995,0.56999999999999995,0.56999999999999995,0.56999999999999995,0.56999999999999995,0.56999999999999995,0.56999999999999995,0.56999999999999995,0.56999999999999995,0.56999999999999995,0.56999999999999995,0.56999999999999995,"I boost Diode avg"]
[" Output Inductor Calculations:",null,null,null,null,null,null,null,"I Cout RMS",{"$f":"SQRT(((J22-J23/2-Iout_PreReg)^2+J23^2/12)*(1-J14)+Iout_PreReg^2*J14)","v":4.385986738394132E-2},0.74671622638905721,0.6935942527217509,0.64536129634004158,0.60114493346961251,0.56026625157628152,0.52218056000485791,0.48643990330971065,0.45266225463311249,0.42049461885543166,0.38961524737809328,0.35971278188606992,0.33046563679058805,0.30152619637042838,0.27246014877868474,0.24273632225148592,0.21158256378490672,2.2965609700408257E-2,2.4814235910326672E-2,2.654065148252787E-2,2.8156577175864186E-2,2.9672282628768254E-2,3.109680401027751E-2,3.2438123668813906E-2,3.3703319294960135E-2,3.4898688463484921E-2,3.6029853165655649E-2,3.710184798231949E-2,3.8119194806929282E-2,3.9085966451442009E-2,4.000584101700326E-2,4.0882148556039125E-2,{"$f":"SQRT(((AP22-AP23/2-Iout_PreReg)^2+AP23^2/12)*(1-AP14)+Iout_PreReg^2*AP14)","v":4.1717911270767412E-2},4.2515878268625157E-2,4.3278555715116789E-2,4.4008233079523909E-2,4.4707006051412645E-2,4.5376796610235602E-2,4.6019370652122915E-2,4.6636353513731695E-2,4.7229243680053067E-2,4.7799424919213719E-2,4.8348177050846056E-2,4.8876685524178058E-2,4.9386049956517797E-2,4.9877291761403257E-2,5.1140022841979917E-2,5.2506597753229994E-2,5.3873172152711958E-2,5.5239746065942646E-2,5.6606319516770733E-2,0.13973126222390836,"I Cout RMS"]
["Lo_est",10,"µH",null,"Recommended inductor value",null,null,"BUCK FET","Rds_On Buck",{"$f":"IF(J2>7,Buck_RdsON_factor_7V*(J4-150)+Rds_ON_150_7V,Buck_RdsON_factor_6V*(J4-150)+Rds_ON_150_6V)","v":0.19191343158159968},0.20759651869757595,0.2066073014682849,0.205885151797878,0.20534587408474139,0.20493681368199188,0.20462353011040194,0.20438245205804031,0.20419695694223644,0.20405587593883129,0.20395069013930306,0.203874888215236,0.20382351827882558,0.19015690790055584,0.19014970666337327,0.19015710931953286,0.19017733148463276,0.19016006210743994,0.19022420021654654,0.19029296622839459,0.19036621165925635,0.19044380643911932,0.19052563614554824,0.19061159972123018,0.19070160757940416,0.19079558002244826,0.19089344591489649,0.19099514156440814,0.19110060977366103,0.19120979903348495,0.1913226628332961,0.1914391590694188,{"$f":"IF(AP2>7,Buck_RdsON_factor_7V*(AP4-150)+Rds_ON_150_7V,Buck_RdsON_factor_6V*(AP4-150)+Rds_ON_150_6V)","v":0.19155924953546594},0.19168289948180708,0.19181007723344382,0.19194075385745696,0.19207490287268528,0.19221249999551063,0.19235352291661922,0.19249795110442486,0.19264576563151248,0.19279694902101899,0.19295148511032931,0.19310935892985448,0.19327055659497985,0.19343506520954454,0.19352598723032577,0.19360707498064267,0.19368835711876906,0.19376982395247727,0.19385146642320439,0.19897775041126928,"Rds_On Buck","BUCK FET"]
["Lo = ",10,"µH",null,"Actual inductor value used.",null,null,null,"Conduction Losses",{"$f":"J25^2*J30","v":2.686933350131358E-2},0.35416650609912187,0.2881961080866397,0.23919137310922542,0.20174216947221624,0.17246508321438583,0.14914708272034713,0.13027355322020734,0.1147763823704557,0.10193789836381566,9.1210704232817547E-2,8.2176403486897115E-2,7.4516804146348578E-2,6.3353074990222483E-2,5.8147824901327354E-2,5.3672270509190406E-2,4.9813400801696224E-2,4.3384849200752827E-2,4.1916887517197153E-2,4.0546808792353881E-2,3.9265209056803523E-2,3.8063850543084504E-2,3.6935486496966902E-2,3.5873716621963092E-2,3.4872867089878051E-2,3.3927890384654484E-2,3.303428126011735E-2,3.2188005868019079E-2,3.1385441711289951E-2,3.0623326542482142E-2,2.9898714691287794E-2,2.920893959158171E-2,{"$f":"AP25^2*AP30","v":2.8551581505513009E-2},2.7924439623154145E-2,2.7325507861270592E-2,2.6752953801650402E-2,2.6205100304081321E-2,2.5680409406080178E-2,2.5177468184441488E-2,2.4694976305368894E-2,2.4231735032581303E-2,2.3786637498077089E-2,2.3358660069572303E-2,2.2946854673097396E-2,2.2550341949723229E-2,2.2168305142596541E-2,2.179127080368063E-2,2.1426084892989927E-2,2.1073246072266082E-2,2.073213870333979E-2,2.0402187398190653E-2,1.0505572370345566E-2,"Conduction Losses"]
["DCR <",75,"mΩ",null,"Recommended inductor DC resistance",null,null,null,"Switching Losses",{"$f":"0.5*J2*Iout_PreReg*J19*10^3*(J2/SLEW_rate+J2/1.5)*10^-9","v":0.20314800000000002},1.3654666666666667E-2,1.6061227821740943E-2,1.866300652505901E-2,2.146000277662086E-2,2.4452216576426492E-2,2.7639647924475923E-2,3.1022296820769141E-2,3.4600163265306134E-2,3.8373247258086933E-2,4.2341548799111506E-2,4.6505067888379867E-2,5.086380452589203E-2,5.5417758711647939E-2,6.0166930445647686E-2,6.5111319727891206E-2,7.0250926558378501E-2,7.5585750937109578E-2,8.1115792864084477E-2,8.6841052339303143E-2,9.2761529362765591E-2,9.887722393447182E-2,0.10518813605442184,0.11169426572261568,0.11839561293905329,0.12529217770373463,0.13238396001665984,0.13967095987782882,0.14715317728724156,0.15483061224489811,0.16270326475079841,0.17077113480494255,{"$f":"0.5*AP2*Iout_PreReg*AP19*10^3*(AP2/SLEW_rate+AP2/1.5)*10^-9","v":0.17903422240733047},0.18749252755796214,0.19614605025683765,0.20499479050395689,0.21403874829931996,0.22327792364292673,0.23271231653477736,0.24234192697487178,0.25216675496321012,0.26218680049979198,0.27240206358461783,0.28281254421768737,0.29341824239900072,0.30421915812855782,0.31035458711695041,0.31585533054771353,0.32135603811644203,0.32685671162022117,0.33235735273808847,0.66691862034337657,"Switching Losses"]
["LoDCR = ",50,"mΩ",null,"Enter the output inductor's DCR",null,null,null,"Total Buck FET Losses",{"$f":"J31+J32","v":0.23001733350131359},{"$f":"K31+K32","v":0.36782117276578852},{"$f":"IF(L15=1/fsw*10^3,L30*L25^2,L31+L32)","v":0.30425733590838067},0.25785437963428443,0.22320217224883709,0.19691729979081232,0.17678673064482306,0.16129585004097649,0.14937654563576183,0.14031114562190258,0.13355225303192905,0.12868147137527697,0.1253806086722406,0.11877083370187042,0.11831475534697504,0.11878359023708161,0.12006432736007472,0.1189706001378624,0.12303268038128162,0.12738786113165701,0.13202673841956911,0.13694107447755632,0.14212362255138875,0.14756798234457877,0.15326848002893134,0.15922006808838912,0.16541824127677718,0.17185896574584791,0.17853861899853152,0.18545393878738026,0.19260197944208621,0.19998007439652427,0.20758580391284348,0.21541696718111628,{"$f":"IF(AR15=1/fsw*10^3,AR30*AR25^2,AR31+AR32)","v":0.22347155811810823},0.23174774430560729,0.24024384860340128,0.24895833304900691,0.25788978471921886,0.26703690328024066,0.27639848999579142,0.28597343799786906,0.29576072365419015,0.30575939889078474,0.31596858434872394,0.32638746327115437,0.33214585792063106,0.33728141544070345,0.34242928418870811,0.34758885032356096,0.35275954013627914,0.67742419271372212,"Total Buck FET Losses"]
["ΔILo_typ",{"$f":"(Vin_nom-Vreg)/(L_buck*10^-6)*(Vreg/Vin_nom)/(fsw*10^3)","v":0.14680976430976433},"APP",null,"Typical output inductor ripple current",null,null,"VUC LDO","Output voltage",{"$f":"IF(J21-Iout_VUC*J35>VUC,VUC,J21-Iout_VUC*J35)","v":3.3},3.3,3.3,3.3,3.3,3.3,3.3,3.3,3.3,3.3,3.3,3.3,3.3,3.3,3.3,3.3,3.3,3.3,3.3,3.3,3.3,3.3,3.3,3.3,3.3,3.3,3.3,3.3,3.3,3.3,3.3,3.3,{"$f":"IF(AP21-Iout_VUC*AP35>VUC,VUC,AP21-Iout_VUC*AP35)","v":3.3},3.3,3.3,3.3,3.3,3.3,3.3,3.3,3.3,3.3,3.3,3.3,3.3,3.3,3.3,3.3,3.3,3.3,3.3,3.3,"Output voltage","5V0 LDO"]
["ΔILo_max",{"$f":"(V_AbsMax-(1-2/100)*Vreg)/((1-$E$18/100)*L_buck*10^-6)*(Vreg/V_AbsMax)/((1-10/100)*fsw*10^3)","v":0.30780013093901987},"APP",null,"Worst case maximum inductor ripple current at Vin_AbsMax, L_min, VREG_max, fsw_min",null,null,null,"Series pass resistance",{"$f":"(Rds_ON_VUC_150-Rds_ON_VUC_min40)/190*(J4-150)+Rds_ON_VUC_150","v":0.50636189928887065},0.510184867903413,0.50842147325038456,0.50713415755290692,0.50617283236801902,0.50544363466945985,0.5048851703012045,0.50445542066087357,0.50412475406340052,0.50387326078196337,0.50368575487226996,0.50355062913483728,0.50345905625427045,0.50327568718127658,0.50326303460754684,0.50327604107441926,0.50331157141849969,0.50328122912277196,0.50339391978047232,0.50351474166328924,0.50364343388531341,0.50377976791353263,0.50392354270772821,0.50407458071020139,0.50423272451701318,0.50439783409944161,0.50456978447247314,0.50474846372866511,0.50493377137232243,0.50512561690183311,0.50532391859810122,0.50552860248496889,{"$f":"(Rds_ON_VUC_150-Rds_ON_VUC_min40)/190*(AP4-150)+Rds_ON_VUC_150","v":0.50573960143381369},0.50595685438953508,0.50618030569916073,0.50640990452755186,0.50664560434730799,0.50688736249211219,0.50713513976449998,0.50738890009047444,0.50764861021456742,0.5079142394299303,0.50818575933884857,0.50846314363975431,0.5087463679373796,0.50903540957316973,0.50919515956368233,0.50933763074098914,0.50948044345767729,0.50962358068450253,0.50976702650557015,0.5187739074726001,"Series pass resistance"]
["Irms",{"$f":"IF(Topology=\"buck\",MAX(K82:BH82),MAX(K24:BH24))","v":1.5504170249524658},"ARMS",null,"Maximum RMS inductor current, must be less than inductor DC rating",null,null,null,"Power dissipated",{"$f":"(J21-J34)*Iout_VUC","v":0.51249999999999996},0.51249999999999996,0.51249999999999996,0.51249999999999996,0.51249999999999996,0.51249999999999996,0.51249999999999996,0.51249999999999996,0.51249999999999996,0.51249999999999996,0.51249999999999996,0.51249999999999996,0.51249999999999996,0.51249999999999996,0.51249999999999996,0.51249999999999996,0.51249999999999996,0.51249999999999996,0.51249999999999996,0.51249999999999996,0.51249999999999996,0.51249999999999996,0.51249999999999996,0.51249999999999996,0.51249999999999996,0.51249999999999996,0.51249999999999996,0.51249999999999996,0.51249999999999996,0.51249999999999996,0.51249999999999996,0.51249999999999996,{"$f":"(AP21-AP34)*Iout_VUC","v":0.51249999999999996},0.51249999999999996,0.51249999999999996,0.51249999999999996,0.51249999999999996,0.51249999999999996,0.51249999999999996,0.51249999999999996,0.51249999999999996,0.51249999999999996,0.51249999999999996,0.51249999999999996,0.51249999999999996,0.51249999999999996,0.51249999999999996,0.51249999999999996,0.51249999999999996,0.51249999999999996,0.51249999999999996,0.51249999999999996,"Power dissipated"]
["Lo_I_max",{"$f":"IF(Topology=\"buck\",MAX(K80:BH80),MAX(K22:BH22))","v":1.59425361315285},"APEAK",null,"This value should not exceed the inductor's specified saturation current",null,null,"V5ALDO","Output voltage",{"$f":"IF(J21-5<J38*Iout_V5C,J21-J38*Iout_V5C,5)","v":5},5,5,5,5,5,5,5,5,5,5,5,5,5,5,5,5,5,5,5,5,5,5,5,5,5,5,5,5,5,5,5,{"$f":"IF(AP21-5<AP38*Iout_V5C,AP21-AP38*Iout_V5C,5)","v":5},5,5,5,5,5,5,5,5,5,5,5,5,5,5,5,5,5,5,5,"Output voltage","V5 LDO"]
["I_LOADCRIT",{"$f":"J81/2","v":7.5029720322429619E-2},"A",null,"Output load current when pre-regulator goes discontinuous",null,null,null,"Series pass resistance",{"$f":"(Rds_ON_V5A_150-Rds_ON_V5A_min40)/190*(J4-150)+Rds_ON_V5A_150","v":0.70777882409637938},0.71776162432604362,0.7131569261654892,0.70979539832255945,0.70728511946754202,0.70538098797010906,0.70392268716102802,0.70280049515770515,0.701937035653319,0.70128031899126242,0.70079069058279708,0.70043784090531214,0.70019871946191958,0.69971989344775021,0.69968685417155663,0.69972081755801674,0.69981359685149502,0.69973436494893437,0.7000286305935155,0.70034412905587429,0.70068017909266811,0.7010361839426793,0.70141161863577528,0.70180601952100408,0.70221897557430624,0.70265012114299252,0.70309912985754497,0.70356570949750441,0.70404959764155672,0.70455055796562893,0.70506837707916237,0.70560286181049348,{"$f":"(Rds_ON_V5A_150-Rds_ON_V5A_min40)/190*(AP4-150)+Rds_ON_V5A_150","v":0.70615383686871769},0.70672114282253085,0.70730463434704016,0.70790417869801248,0.70851965437987996,0.70915094997940276,0.70979796314144894,0.71046059966710118,0.71113877271737924,0.71183240210843501,0.71254141368619084,0.7132657387701723,0.71400531365776743,0.71476007918139028,0.71517722941273454,0.71554926001118857,0.71592218246091244,0.7162959522939657,0.71667052794966168,0.74018991888690344,"Series pass resistance"]
[" Output Capacitor and Output Voltage Ripple:",null,null,null,null,null,null,null,"Power dissipated",{"$f":"(J21-J37)*Iout_V5C","v":3.4999999999999969E-2},3.4999999999999969E-2,3.4999999999999969E-2,3.4999999999999969E-2,3.4999999999999969E-2,3.4999999999999969E-2,3.4999999999999969E-2,3.4999999999999969E-2,3.4999999999999969E-2,3.4999999999999969E-2,3.4999999999999969E-2,3.4999999999999969E-2,3.4999999999999969E-2,3.4999999999999969E-2,3.4999999999999969E-2,3.4999999999999969E-2,3.4999999999999969E-2,3.4999999999999969E-2,3.4999999999999969E-2,3.4999999999999969E-2,3.4999999999999969E-2,3.4999999999999969E-2,3.4999999999999969E-2,3.4999999999999969E-2,3.4999999999999969E-2,3.4999999999999969E-2,3.4999999999999969E-2,3.4999999999999969E-2,3.4999999999999969E-2,3.4999999999999969E-2,3.4999999999999969E-2,3.4999999999999969E-2,{"$f":"(AP21-AP37)*Iout_V5C","v":3.4999999999999969E-2},3.4999999999999969E-2,3.4999999999999969E-2,3.4999999999999969E-2,3.4999999999999969E-2,3.4999999999999969E-2,3.4999999999999969E-2,3.4999999999999969E-2,3.4999999999999969E-2,3.4999999999999969E-2,3.4999999999999969E-2,3.4999999999999969E-2,3.4999999999999969E-2,3.4999999999999969E-2,3.4999999999999969E-2,3.4999999999999969E-2,3.4999999999999969E-2,3.4999999999999969E-2,3.4999999999999969E-2,3.4999999999999969E-2,"Power dissipated"]
["Total Output Capacitance",44,"µF",null,"Recommended total output capacitance",null,null,"V5P1 LDO","Output voltage",5,{"$f":"J40","v":5},{"$f":"K40","v":5},5,5,5,5,5,5,5,5,5,5,5,5,5,5,5,5,5,5,5,5,5,5,5,5,5,5,5,5,5,5,5,5,5,5,5,5,5,5,5,5,5,5,5,5,5,5,5,5,5,"Output voltage","V5 LDO"]
["ESR",10,"mΩ",null,null,null,null,null,"Series pass resistance",{"$f":"(Rds_ON_V5P1_150-Rds_ON_V5P1_min40)/190*(J4-150)+Rds_ON_V5P1_150","v":0.70777882409637938},0.71776162432604362,0.7131569261654892,0.70979539832255945,0.70728511946754202,0.70538098797010906,0.70392268716102802,0.70280049515770515,0.701937035653319,0.70128031899126242,0.70079069058279708,0.70043784090531214,0.70019871946191958,0.69971989344775021,0.69968685417155663,0.69972081755801674,0.69981359685149502,0.69973436494893437,0.7000286305935155,0.70034412905587429,0.70068017909266811,0.7010361839426793,0.70141161863577528,0.70180601952100408,0.70221897557430624,0.70265012114299252,0.70309912985754497,0.70356570949750441,0.70404959764155672,0.70455055796562893,0.70506837707916237,0.70560286181049348,{"$f":"(Rds_ON_V5P1_150-Rds_ON_V5P1_min40)/190*(AP4-150)+Rds_ON_V5P1_150","v":0.70615383686871769},0.70672114282253085,0.70730463434704016,0.70790417869801248,0.70851965437987996,0.70915094997940276,0.70979796314144894,0.71046059966710118,0.71113877271737924,0.71183240210843501,0.71254141368619084,0.7132657387701723,0.71400531365776743,0.71476007918139028,0.71517722941273454,0.71554926001118857,0.71592218246091244,0.7162959522939657,0.71667052794966168,0.74018991888690344,"Series pass resistance"]
["I RMS",{"$f":"ROUNDUP(IF(Topology=\"Buck\",MAX(K85:BH85),MAX(K29:BH29)),3)","v":0.747},"A",null,"Total RMS current of the output capacitors",null,null,null,"Power dissipated",{"$f":"(J21-J40)*Iout_V5P1","v":3.4999999999999969E-2},3.4999999999999969E-2,3.4999999999999969E-2,3.4999999999999969E-2,3.4999999999999969E-2,3.4999999999999969E-2,3.4999999999999969E-2,3.4999999999999969E-2,3.4999999999999969E-2,3.4999999999999969E-2,3.4999999999999969E-2,3.4999999999999969E-2,3.4999999999999969E-2,3.4999999999999969E-2,3.4999999999999969E-2,3.4999999999999969E-2,3.4999999999999969E-2,3.4999999999999969E-2,3.4999999999999969E-2,3.4999999999999969E-2,3.4999999999999969E-2,3.4999999999999969E-2,3.4999999999999969E-2,3.4999999999999969E-2,3.4999999999999969E-2,3.4999999999999969E-2,3.4999999999999969E-2,3.4999999999999969E-2,3.4999999999999969E-2,3.4999999999999969E-2,3.4999999999999969E-2,3.4999999999999969E-2,{"$f":"(AP21-AP40)*Iout_V5P1","v":3.4999999999999969E-2},3.4999999999999969E-2,3.4999999999999969E-2,3.4999999999999969E-2,3.4999999999999969E-2,3.4999999999999969E-2,3.4999999999999969E-2,3.4999999999999969E-2,3.4999999999999969E-2,3.4999999999999969E-2,3.4999999999999969E-2,3.4999999999999969E-2,3.4999999999999969E-2,3.4999999999999969E-2,3.4999999999999969E-2,3.4999999999999969E-2,3.4999999999999969E-2,3.4999999999999969E-2,3.4999999999999969E-2,3.4999999999999969E-2,"Power dissipated"]
["Select Capacitor",10,"µF",null,null,null,null,"V5P2 LDO","Output voltage",5,{"$f":"J43","v":5},{"$f":"K43","v":5},5,5,5,5,5,5,5,5,5,5,5,5,5,5,5,5,5,5,5,5,5,5,5,5,5,5,5,5,5,5,5,5,5,5,5,5,5,5,5,5,5,5,5,5,5,5,5,5,5,"Output voltage","V5 LDO"]
["ESR",5,"mΩ",null,"Enter ESR value for selected capacitor",null,null,null,"Series pass resistance",{"$f":"(Rds_ON_V5P2_150-Rds_ON_V5P2_min40)/190*(J4-150)+Rds_ON_V5P2_150","v":0.70777882409637938},0.71776162432604362,0.7131569261654892,0.70979539832255945,0.70728511946754202,0.70538098797010906,0.70392268716102802,0.70280049515770515,0.701937035653319,0.70128031899126242,0.70079069058279708,0.70043784090531214,0.70019871946191958,0.69971989344775021,0.69968685417155663,0.69972081755801674,0.69981359685149502,0.69973436494893437,0.7000286305935155,0.70034412905587429,0.70068017909266811,0.7010361839426793,0.70141161863577528,0.70180601952100408,0.70221897557430624,0.70265012114299252,0.70309912985754497,0.70356570949750441,0.70404959764155672,0.70455055796562893,0.70506837707916237,0.70560286181049348,{"$f":"(Rds_ON_V5P2_150-Rds_ON_V5P2_min40)/190*(AP4-150)+Rds_ON_V5P2_150","v":0.70615383686871769},0.70672114282253085,0.70730463434704016,0.70790417869801248,0.70851965437987996,0.70915094997940276,0.70979796314144894,0.71046059966710118,0.71113877271737924,0.71183240210843501,0.71254141368619084,0.7132657387701723,0.71400531365776743,0.71476007918139028,0.71517722941273454,0.71554926001118857,0.71592218246091244,0.7162959522939657,0.71667052794966168,0.74018991888690344,"Series pass resistance"]
["Co_num_actual =",4,"pieces",null,"Choose the number of output capacitors, default is estimated number",null,null,null,"Power dissipated",{"$f":"(J21-J43)*Iout_V5P2","v":3.4999999999999969E-2},3.4999999999999969E-2,3.4999999999999969E-2,3.4999999999999969E-2,3.4999999999999969E-2,3.4999999999999969E-2,3.4999999999999969E-2,3.4999999999999969E-2,3.4999999999999969E-2,3.4999999999999969E-2,3.4999999999999969E-2,3.4999999999999969E-2,3.4999999999999969E-2,3.4999999999999969E-2,3.4999999999999969E-2,3.4999999999999969E-2,3.4999999999999969E-2,3.4999999999999969E-2,3.4999999999999969E-2,3.4999999999999969E-2,3.4999999999999969E-2,3.4999999999999969E-2,3.4999999999999969E-2,3.4999999999999969E-2,3.4999999999999969E-2,3.4999999999999969E-2,3.4999999999999969E-2,3.4999999999999969E-2,3.4999999999999969E-2,3.4999999999999969E-2,3.4999999999999969E-2,3.4999999999999969E-2,{"$f":"(AP21-AP43)*Iout_V5P2","v":3.4999999999999969E-2},3.4999999999999969E-2,3.4999999999999969E-2,3.4999999999999969E-2,3.4999999999999969E-2,3.4999999999999969E-2,3.4999999999999969E-2,3.4999999999999969E-2,3.4999999999999969E-2,3.4999999999999969E-2,3.4999999999999969E-2,3.4999999999999969E-2,3.4999999999999969E-2,3.4999999999999969E-2,3.4999999999999969E-2,3.4999999999999969E-2,3.4999999999999969E-2,3.4999999999999969E-2,3.4999999999999969E-2,3.4999999999999969E-2,"Power dissipated"]
["Pre-Regulator Boost FET",null,null,null,null,null,null,"Buck Diode","Tj Diode",{"$f":"J49*RthJA_diode+Ta","v":131.61211469077085},135.97608064884409,135.35058817083845,134.72644072017036,134.13362477475923,133.58365695270425,133.07951705046133,132.60224242610727,132.13502293016873,131.71764105817522,131.34338480058676,131.0075887148532,130.7061155066946,130.44870649590482,130.20376727881595,129.98391478178385,129.78670314233509,128.51364569045836,128.79149541150426,129.05031847468973,129.29200292019635,129.5181951785361,129.73033749191131,129.92969859426952,130.11739902463651,130.29443213725423,130.46168163795758,130.6199362985115,130.76990236461373,130.91221406835967,131.04744257445779,131.17610362572276,{"$f":"AP49*RthJA_diode+Ta","v":131.29866410316652},131.41554767622938,131.52713968699311,131.63379138681273,131.73582362333562,131.83353005930257,131.9271799910392,132.01702082352222,132.10328024985336,132.18616817551066,132.26587842156854,132.34259023594205,132.41646963742852,132.48767061373195,132.55634618301863,132.62262033090767,132.6866156059429,132.74844753607613,132.80822397173213,134.58610006765892,"Tj Diode","Buck Diode"]
["Rds ON boost",{"$f":"Vreg*Iout_PreReg*0.05/K27^2/1.4","v":7.1414887423060305E-2},null,null,"Recommended boost MOSFET Rds On at 25C",null,null,null,"I Buck diode ON",{"$f":"J22-J23/2","v":0.56999999999999995},1.5501925971615949,1.4156218529059232,1.3017202457140018,1.2041338238536607,1.1196771086960455,1.0459652484798252,0.98118344572378546,0.92392652751552329,0.87306017095363408,0.82768763439707926,0.78708823827801278,0.75067261715288924,0.7179670287177855,0.68853566053936988,0.66205663291028571,0.63824164636760239,0.56999999999999995,0.56999999999999995,0.56999999999999995,0.56999999999999995,0.56999999999999995,0.56999999999999995,0.56999999999999995,0.56999999999999995,0.56999999999999995,0.56999999999999995,0.56999999999999995,0.56999999999999995,0.56999999999999995,0.56999999999999995,0.56999999999999995,{"$f":"AP22-AP23/2","v":0.56999999999999995},0.56999999999999995,0.56999999999999995,0.56999999999999995,0.56999999999999995,0.56999999999999995,0.56999999999999995,0.56999999999999995,0.56999999999999995,0.56999999999999995,0.56999999999999995,0.56999999999999984,0.57000000000000006,0.56999999999999995,0.56999999999999995,0.56999999999999995,0.56999999999999995,0.56999999999999984,0.56999999999999995,0.56999999999999995,"I Buck diode ON"]
["Maximum gate charge",{"$f":"IF(Topology=\"Buck\",\"-\",10)","v":10},null,null,"At Vgs = 5V",null,null,null,"Vf buck diode",{"$f":"IF(Reset=1,0.45,FORECAST(J47, OFFSET(Vd_1:Vd_3,MATCH(J47,I_Vd1:I_Vd3,1)-1,0,2), OFFSET(I_Vd1:I_Vd3,MATCH(J47,I_Vd1:I_Vd3,1)-1,0,2))+(J46-25)*vd_temp_coeff/1000)","v":0.23981546237107501},{"$f":"IF(Reset=1,0.45,FORECAST(K47, OFFSET(Vd_1:Vd_3,MATCH(K47,I_Vd1:I_Vd3,1)-1,0,2), OFFSET(I_Vd1:I_Vd3,MATCH(K47,I_Vd1:I_Vd3,1)-1,0,2))+(K46-25)*vd_temp_coeff/1000)","v":0.287002431783979},{"$f":"IF(Reset=1,0.45,FORECAST(L47, OFFSET(Vd_1:Vd_3,MATCH(L47,I_Vd1:I_Vd3,1)-1,0,2), OFFSET(I_Vd1:I_Vd3,MATCH(L47,I_Vd1:I_Vd3,1)-1,0,2))+(L46-25)*vd_temp_coeff/1000)","v":0.28281876213487778},{"$f":"IF(Reset=1,0.45,FORECAST(M47, OFFSET(Vd_1:Vd_3,MATCH(M47,I_Vd1:I_Vd3,1)-1,0,2), OFFSET(I_Vd1:I_Vd3,MATCH(M47,I_Vd1:I_Vd3,1)-1,0,2))+(M46-25)*vd_temp_coeff/1000)","v":0.27939134681197569},{"$f":"IF(Reset=1,0.45,FORECAST(N47, OFFSET(Vd_1:Vd_3,MATCH(N47,I_Vd1:I_Vd3,1)-1,0,2), OFFSET(I_Vd1:I_Vd3,MATCH(N47,I_Vd1:I_Vd3,1)-1,0,2))+(N46-25)*vd_temp_coeff/1000)","v":0.27652455714492324},{"$f":"IF(Reset=1,0.45,FORECAST(O47, OFFSET(Vd_1:Vd_3,MATCH(O47,I_Vd1:I_Vd3,1)-1,0,2), OFFSET(I_Vd1:I_Vd3,MATCH(O47,I_Vd1:I_Vd3,1)-1,0,2))+(O46-25)*vd_temp_coeff/1000)","v":0.27408777230894332},{"$f":"IF(Reset=1,0.45,FORECAST(P47, OFFSET(Vd_1:Vd_3,MATCH(P47,I_Vd1:I_Vd3,1)-1,0,2), OFFSET(I_Vd1:I_Vd3,MATCH(P47,I_Vd1:I_Vd3,1)-1,0,2))+(P46-25)*vd_temp_coeff/1000)","v":0.27198997198370672},{"$f":"IF(Reset=1,0.45,FORECAST(Q47, OFFSET(Vd_1:Vd_3,MATCH(Q47,I_Vd1:I_Vd3,1)-1,0,2), OFFSET(I_Vd1:I_Vd3,MATCH(Q47,I_Vd1:I_Vd3,1)-1,0,2))+(Q46-25)*vd_temp_coeff/1000)","v":0.26946606751795521},{"$f":"IF(Reset=1,0.45,FORECAST(R47, OFFSET(Vd_1:Vd_3,MATCH(R47,I_Vd1:I_Vd3,1)-1,0,2), OFFSET(I_Vd1:I_Vd3,MATCH(R47,I_Vd1:I_Vd3,1)-1,0,2))+(R46-25)*vd_temp_coeff/1000)","v":0.26573246204746181},{"$f":"IF(Reset=1,0.45,FORECAST(S47, OFFSET(Vd_1:Vd_3,MATCH(S47,I_Vd1:I_Vd3,1)-1,0,2), OFFSET(I_Vd1:I_Vd3,MATCH(S47,I_Vd1:I_Vd3,1)-1,0,2))+(S46-25)*vd_temp_coeff/1000)","v":0.26241834355171229},{"$f":"IF(Reset=1,0.45,FORECAST(T47, OFFSET(Vd_1:Vd_3,MATCH(T47,I_Vd1:I_Vd3,1)-1,0,2), OFFSET(I_Vd1:I_Vd3,MATCH(T47,I_Vd1:I_Vd3,1)-1,0,2))+(T46-25)*vd_temp_coeff/1000)","v":0.25946451081907684},{"$f":"IF(Reset=1,0.45,FORECAST(U47, OFFSET(Vd_1:Vd_3,MATCH(U47,I_Vd1:I_Vd3,1)-1,0,2), OFFSET(I_Vd1:I_Vd3,MATCH(U47,I_Vd1:I_Vd3,1)-1,0,2))+(U46-25)*vd_temp_coeff/1000)","v":0.25682251141302714},{"$f":"IF(Reset=1,0.45,FORECAST(V47, OFFSET(Vd_1:Vd_3,MATCH(V47,I_Vd1:I_Vd3,1)-1,0,2), OFFSET(I_Vd1:I_Vd3,MATCH(V47,I_Vd1:I_Vd3,1)-1,0,2))+(V46-25)*vd_temp_coeff/1000)","v":0.25445310767843321},{"$f":"IF(Reset=1,0.45,FORECAST(W47, OFFSET(Vd_1:Vd_3,MATCH(W47,I_Vd1:I_Vd3,1)-1,0,2), OFFSET(I_Vd1:I_Vd3,MATCH(W47,I_Vd1:I_Vd3,1)-1,0,2))+(W46-25)*vd_temp_coeff/1000)","v":0.25230907935874813},{"$f":"IF(Reset=1,0.45,FORECAST(X47, OFFSET(Vd_1:Vd_3,MATCH(X47,I_Vd1:I_Vd3,1)-1,0,2), OFFSET(I_Vd1:I_Vd3,MATCH(X47,I_Vd1:I_Vd3,1)-1,0,2))+(X46-25)*vd_temp_coeff/1000)","v":0.25039565380587359},{"$f":"IF(Reset=1,0.45,FORECAST(Y47, OFFSET(Vd_1:Vd_3,MATCH(Y47,I_Vd1:I_Vd3,1)-1,0,2), OFFSET(I_Vd1:I_Vd3,MATCH(Y47,I_Vd1:I_Vd3,1)-1,0,2))+(Y46-25)*vd_temp_coeff/1000)","v":0.24867354973013081},{"$f":"IF(Reset=1,0.45,FORECAST(Z47, OFFSET(Vd_1:Vd_3,MATCH(Z47,I_Vd1:I_Vd3,1)-1,0,2), OFFSET(I_Vd1:I_Vd3,MATCH(Z47,I_Vd1:I_Vd3,1)-1,0,2))+(Z46-25)*vd_temp_coeff/1000)","v":0.24712407970676811},{"$f":"IF(Reset=1,0.45,FORECAST(AA47, OFFSET(Vd_1:Vd_3,MATCH(AA47,I_Vd1:I_Vd3,1)-1,0,2), OFFSET(I_Vd1:I_Vd3,MATCH(AA47,I_Vd1:I_Vd3,1)-1,0,2))+(AA46-25)*vd_temp_coeff/1000)","v":0.24353362517145},{"$f":"IF(Reset=1,0.45,FORECAST(AB47, OFFSET(Vd_1:Vd_3,MATCH(AB47,I_Vd1:I_Vd3,1)-1,0,2), OFFSET(I_Vd1:I_Vd3,MATCH(AB47,I_Vd1:I_Vd3,1)-1,0,2))+(AB46-25)*vd_temp_coeff/1000)","v":0.24320020550619492},{"$f":"IF(Reset=1,0.45,FORECAST(AC47, OFFSET(Vd_1:Vd_3,MATCH(AC47,I_Vd1:I_Vd3,1)-1,0,2), OFFSET(I_Vd1:I_Vd3,MATCH(AC47,I_Vd1:I_Vd3,1)-1,0,2))+(AC46-25)*vd_temp_coeff/1000)","v":0.24288961783037236},{"$f":"IF(Reset=1,0.45,FORECAST(AD47, OFFSET(Vd_1:Vd_3,MATCH(AD47,I_Vd1:I_Vd3,1)-1,0,2), OFFSET(I_Vd1:I_Vd3,MATCH(AD47,I_Vd1:I_Vd3,1)-1,0,2))+(AD46-25)*vd_temp_coeff/1000)","v":0.2425995964957644},{"$f":"IF(Reset=1,0.45,FORECAST(AE47, OFFSET(Vd_1:Vd_3,MATCH(AE47,I_Vd1:I_Vd3,1)-1,0,2), OFFSET(I_Vd1:I_Vd3,MATCH(AE47,I_Vd1:I_Vd3,1)-1,0,2))+(AE46-25)*vd_temp_coeff/1000)","v":0.24232816578575669},{"$f":"IF(Reset=1,0.45,FORECAST(AF47, OFFSET(Vd_1:Vd_3,MATCH(AF47,I_Vd1:I_Vd3,1)-1,0,2), OFFSET(I_Vd1:I_Vd3,MATCH(AF47,I_Vd1:I_Vd3,1)-1,0,2))+(AF46-25)*vd_temp_coeff/1000)","v":0.24207359500970643},{"$f":"IF(Reset=1,0.45,FORECAST(AG47, OFFSET(Vd_1:Vd_3,MATCH(AG47,I_Vd1:I_Vd3,1)-1,0,2), OFFSET(I_Vd1:I_Vd3,MATCH(AG47,I_Vd1:I_Vd3,1)-1,0,2))+(AG46-25)*vd_temp_coeff/1000)","v":0.24183436168687661},{"$f":"IF(Reset=1,0.45,FORECAST(AH47, OFFSET(Vd_1:Vd_3,MATCH(AH47,I_Vd1:I_Vd3,1)-1,0,2), OFFSET(I_Vd1:I_Vd3,MATCH(AH47,I_Vd1:I_Vd3,1)-1,0,2))+(AH46-25)*vd_temp_coeff/1000)","v":0.24160912117043623},{"$f":"IF(Reset=1,0.45,FORECAST(AI47, OFFSET(Vd_1:Vd_3,MATCH(AI47,I_Vd1:I_Vd3,1)-1,0,2), OFFSET(I_Vd1:I_Vd3,MATCH(AI47,I_Vd1:I_Vd3,1)-1,0,2))+(AI46-25)*vd_temp_coeff/1000)","v":0.24139668143529494},{"$f":"IF(Reset=1,0.45,FORECAST(AJ47, OFFSET(Vd_1:Vd_3,MATCH(AJ47,I_Vd1:I_Vd3,1)-1,0,2), OFFSET(I_Vd1:I_Vd3,MATCH(AJ47,I_Vd1:I_Vd3,1)-1,0,2))+(AJ46-25)*vd_temp_coeff/1000)","v":0.24119598203445092},{"$f":"IF(Reset=1,0.45,FORECAST(AK47, OFFSET(Vd_1:Vd_3,MATCH(AK47,I_Vd1:I_Vd3,1)-1,0,2), OFFSET(I_Vd1:I_Vd3,MATCH(AK47,I_Vd1:I_Vd3,1)-1,0,2))+(AK46-25)*vd_temp_coeff/1000)","v":0.24100607644178623},{"$f":"IF(Reset=1,0.45,FORECAST(AL47, OFFSET(Vd_1:Vd_3,MATCH(AL47,I_Vd1:I_Vd3,1)-1,0,2), OFFSET(I_Vd1:I_Vd3,MATCH(AL47,I_Vd1:I_Vd3,1)-1,0,2))+(AL46-25)*vd_temp_coeff/1000)","v":0.24082611716246355},{"$f":"IF(Reset=1,0.45,FORECAST(AM47, OFFSET(Vd_1:Vd_3,MATCH(AM47,I_Vd1:I_Vd3,1)-1,0,2), OFFSET(I_Vd1:I_Vd3,MATCH(AM47,I_Vd1:I_Vd3,1)-1,0,2))+(AM46-25)*vd_temp_coeff/1000)","v":0.24065534311796843},{"$f":"IF(Reset=1,0.45,FORECAST(AN47, OFFSET(Vd_1:Vd_3,MATCH(AN47,I_Vd1:I_Vd3,1)-1,0,2), OFFSET(I_Vd1:I_Vd3,MATCH(AN47,I_Vd1:I_Vd3,1)-1,0,2))+(AN46-25)*vd_temp_coeff/1000)","v":0.2404930689106507},{"$f":"IF(Reset=1,0.45,FORECAST(AO47, OFFSET(Vd_1:Vd_3,MATCH(AO47,I_Vd1:I_Vd3,1)-1,0,2), OFFSET(I_Vd1:I_Vd3,MATCH(AO47,I_Vd1:I_Vd3,1)-1,0,2))+(AO46-25)*vd_temp_coeff/1000)","v":0.24033867564913272},{"$f":"IF(Reset=1,0.45,FORECAST(AP47, OFFSET(Vd_1:Vd_3,MATCH(AP47,I_Vd1:I_Vd3,1)-1,0,2), OFFSET(I_Vd1:I_Vd3,MATCH(AP47,I_Vd1:I_Vd3,1)-1,0,2))+(AP46-25)*vd_temp_coeff/1000)","v":0.24019160307620019},{"$f":"IF(Reset=1,0.45,FORECAST(AQ47, OFFSET(Vd_1:Vd_3,MATCH(AQ47,I_Vd1:I_Vd3,1)-1,0,2), OFFSET(I_Vd1:I_Vd3,MATCH(AQ47,I_Vd1:I_Vd3,1)-1,0,2))+(AQ46-25)*vd_temp_coeff/1000)","v":0.24005134278852477},{"$f":"IF(Reset=1,0.45,FORECAST(AR47, OFFSET(Vd_1:Vd_3,MATCH(AR47,I_Vd1:I_Vd3,1)-1,0,2), OFFSET(I_Vd1:I_Vd3,MATCH(AR47,I_Vd1:I_Vd3,1)-1,0,2))+(AR46-25)*vd_temp_coeff/1000)","v":0.23991743237560828},{"$f":"IF(Reset=1,0.45,FORECAST(AS47, OFFSET(Vd_1:Vd_3,MATCH(AS47,I_Vd1:I_Vd3,1)-1,0,2), OFFSET(I_Vd1:I_Vd3,MATCH(AS47,I_Vd1:I_Vd3,1)-1,0,2))+(AS46-25)*vd_temp_coeff/1000)","v":0.23978945033582474},{"$f":"IF(Reset=1,0.45,FORECAST(AT47, OFFSET(Vd_1:Vd_3,MATCH(AT47,I_Vd1:I_Vd3,1)-1,0,2), OFFSET(I_Vd1:I_Vd3,MATCH(AT47,I_Vd1:I_Vd3,1)-1,0,2))+(AT46-25)*vd_temp_coeff/1000)","v":0.23966701165199727},{"$f":"IF(Reset=1,0.45,FORECAST(AU47, OFFSET(Vd_1:Vd_3,MATCH(AU47,I_Vd1:I_Vd3,1)-1,0,2), OFFSET(I_Vd1:I_Vd3,MATCH(AU47,I_Vd1:I_Vd3,1)-1,0,2))+(AU46-25)*vd_temp_coeff/1000)","v":0.23954976392883692},{"$f":"IF(Reset=1,0.45,FORECAST(AV47, OFFSET(Vd_1:Vd_3,MATCH(AV47,I_Vd1:I_Vd3,1)-1,0,2), OFFSET(I_Vd1:I_Vd3,MATCH(AV47,I_Vd1:I_Vd3,1)-1,0,2))+(AV46-25)*vd_temp_coeff/1000)","v":0.23943738401075298},{"$f":"IF(Reset=1,0.45,FORECAST(AW47, OFFSET(Vd_1:Vd_3,MATCH(AW47,I_Vd1:I_Vd3,1)-1,0,2), OFFSET(I_Vd1:I_Vd3,MATCH(AW47,I_Vd1:I_Vd3,1)-1,0,2))+(AW46-25)*vd_temp_coeff/1000)","v":0.23932957501177338},{"$f":"IF(Reset=1,0.45,FORECAST(AX47, OFFSET(Vd_1:Vd_3,MATCH(AX47,I_Vd1:I_Vd3,1)-1,0,2), OFFSET(I_Vd1:I_Vd3,MATCH(AX47,I_Vd1:I_Vd3,1)-1,0,2))+(AX46-25)*vd_temp_coeff/1000)","v":0.23922606370017602},{"$f":"IF(Reset=1,0.45,FORECAST(AY47, OFFSET(Vd_1:Vd_3,MATCH(AY47,I_Vd1:I_Vd3,1)-1,0,2), OFFSET(I_Vd1:I_Vd3,MATCH(AY47,I_Vd1:I_Vd3,1)-1,0,2))+(AY46-25)*vd_temp_coeff/1000)","v":0.23912659818938722},{"$f":"IF(Reset=1,0.45,FORECAST(AZ47, OFFSET(Vd_1:Vd_3,MATCH(AZ47,I_Vd1:I_Vd3,1)-1,0,2), OFFSET(I_Vd1:I_Vd3,MATCH(AZ47,I_Vd1:I_Vd3,1)-1,0,2))+(AZ46-25)*vd_temp_coeff/1000)","v":0.23903094589411777},{"$f":"IF(Reset=1,0.45,FORECAST(BA47, OFFSET(Vd_1:Vd_3,MATCH(BA47,I_Vd1:I_Vd3,1)-1,0,2), OFFSET(I_Vd1:I_Vd3,MATCH(BA47,I_Vd1:I_Vd3,1)-1,0,2))+(BA46-25)*vd_temp_coeff/1000)","v":0.23893889171686955},{"$f":"IF(Reset=1,0.45,FORECAST(BB47, OFFSET(Vd_1:Vd_3,MATCH(BB47,I_Vd1:I_Vd3,1)-1,0,2), OFFSET(I_Vd1:I_Vd3,MATCH(BB47,I_Vd1:I_Vd3,1)-1,0,2))+(BB46-25)*vd_temp_coeff/1000)","v":0.23885023643508579},{"$f":"IF(Reset=1,0.45,FORECAST(BC47, OFFSET(Vd_1:Vd_3,MATCH(BC47,I_Vd1:I_Vd3,1)-1,0,2), OFFSET(I_Vd1:I_Vd3,MATCH(BC47,I_Vd1:I_Vd3,1)-1,0,2))+(BC46-25)*vd_temp_coeff/1000)","v":0.23876479526352171},{"$f":"IF(Reset=1,0.45,FORECAST(BD47, OFFSET(Vd_1:Vd_3,MATCH(BD47,I_Vd1:I_Vd3,1)-1,0,2), OFFSET(I_Vd1:I_Vd3,MATCH(BD47,I_Vd1:I_Vd3,1)-1,0,2))+(BD46-25)*vd_temp_coeff/1000)","v":0.23868238458037769},{"$f":"IF(Reset=1,0.45,FORECAST(BE47, OFFSET(Vd_1:Vd_3,MATCH(BE47,I_Vd1:I_Vd3,1)-1,0,2), OFFSET(I_Vd1:I_Vd3,MATCH(BE47,I_Vd1:I_Vd3,1)-1,0,2))+(BE46-25)*vd_temp_coeff/1000)","v":0.23860285560291083},{"$f":"IF(Reset=1,0.45,FORECAST(BF47, OFFSET(Vd_1:Vd_3,MATCH(BF47,I_Vd1:I_Vd3,1)-1,0,2), OFFSET(I_Vd1:I_Vd3,MATCH(BF47,I_Vd1:I_Vd3,1)-1,0,2))+(BF46-25)*vd_temp_coeff/1000)","v":0.23852606127286854},{"$f":"IF(Reset=1,0.45,FORECAST(BG47, OFFSET(Vd_1:Vd_3,MATCH(BG47,I_Vd1:I_Vd3,1)-1,0,2), OFFSET(I_Vd1:I_Vd3,MATCH(BG47,I_Vd1:I_Vd3,1)-1,0,2))+(BG46-25)*vd_temp_coeff/1000)","v":0.23845186295670867},{"$f":"IF(Reset=1,0.45,FORECAST(BH47, OFFSET(Vd_1:Vd_3,MATCH(BH47,I_Vd1:I_Vd3,1)-1,0,2), OFFSET(I_Vd1:I_Vd3,MATCH(BH47,I_Vd1:I_Vd3,1)-1,0,2))+(BH46-25)*vd_temp_coeff/1000)","v":0.23838013123392146},{"$f":"IF(Reset=1,0.45,FORECAST(BI47, OFFSET(Vd_1:Vd_3,MATCH(BI47,I_Vd1:I_Vd3,1)-1,0,2), OFFSET(I_Vd1:I_Vd3,MATCH(BI47,I_Vd1:I_Vd3,1)-1,0,2))+(BI46-25)*vd_temp_coeff/1000)","v":0.23624667991880932},"Vf buck diode"]
["Max Vds",{"$f":"IF(Topology=\"Buck\",\"-\",Vreg+4)","v":9.35},null,null,{"$f":"IF(Topology=\"Buck\",\"\",\"Select MOSFET with higher VDS rating\")","v":"Select MOSFET with higher VDS rating"},null,null,null,"Pdiss buck diode",{"$f":"J48*J26","v":7.7789584597304104E-2},0.1291303605746362,0.12177162553927572,0.11442871435494527,0.10745440911481428,0.10098419944357932,9.5053141770133326E-2,8.943814618949722E-2,8.3941446237279269E-2,7.9031071272649675E-2,7.4628056477491461E-2,7.0677514292390733E-2,6.7130770666995326E-2,6.4102429363586122E-2,6.1220791515481668E-2,5.8634291550398399E-2,5.6314154615706775E-2,4.1337008123039663E-2,4.4605828370638409E-2,4.7650805584585204E-2,5.0494152002310132E-2,5.3155237394542504E-2,5.5651029316603685E-2,5.7996454050229823E-2,6.0204694407488366E-2,6.2287436908873263E-2,6.425507809361862E-2,6.6116897629546964E-2,6.7881204289573407E-2,6.9555459627760982E-2,7.1146383228915103E-2,7.266004265556178E-2,{"$f":"AP48*AP26","v":7.4101930625488421E-2},7.5477031485051499E-2,7.6789878670507239E-2,7.8044604550738125E-2,7.9244983803948538E-2,8.0394471285912497E-2,8.1496235188696323E-2,8.2553186159084857E-2,8.3568002939451103E-2,8.4543155006007842E-2,8.5480922606688686E-2,8.6383414540494835E-2,8.7252583969747319E-2,8.8090242514493697E-2,8.8898190388454465E-2,8.9677886245972616E-2,9.0430771834622586E-2,9.1158206306778095E-2,9.1861458490966247E-2,0.1127776478548108,"Pdiss buck diode"]
["Rds ON boost",2.9000000000000001E-2,"Ω",null,"Enter Rds ON at 25C of selected boost MOSFET",null,null,"Boost Diode","Tj Boost Diode",{"$f":"J53*RthJA_diode+Ta","v":137.37301492679671},139.87022895108592,139.64598031387658,139.45573292514595,139.29216518758315,139.14991934886777,139.02498373875738,138.914305406214,138.76554601944466,138.58390941551002,138.41961042425029,138.27016912987813,138.1335575884616,138.00832093381274,137.89257717292648,137.7854293374867,137.68588547594081,137.37301492679671,137.37301492679671,137.37301492679671,137.37301492679671,137.37301492679671,137.37301492679671,137.37301492679671,137.37301492679671,137.37301492679671,137.37301492679671,137.37301492679671,137.37301492679671,137.37301492679671,137.37301492679671,137.37301492679671,{"$f":"AP53*RthJA_diode+Ta","v":137.37301492679671},137.37301492679671,137.37301492679671,137.37301492679671,137.37301492679671,137.37301492679671,137.37301492679671,137.37301492679671,137.37301492679671,137.37301492679671,137.37301492679671,137.37301492679671,137.37301492679671,137.37301492679671,137.37301492679671,137.37301492679671,137.37301492679671,137.37301492679671,137.37301492679671,137.37301492679671,"Tj Boost Diode","Boost Diode"]
["Rthj-a",40,"°C/W",null,"Enter MOSFET junction to ambient thermal resistance",null,null,null,"I boost diode ON",{"$f":"IF(J17=0,J28,IF(J$12>J$14,J22,J22-J23/2))","v":0.56999999999999995},1.59425361315285,1.4619071545645423,1.3496274615081689,1.2530934933417057,1.169143226186556,1.0954090632705733,1.0300892221475091,0.97178857216009185,0.91938075725943691,0.87197538336572644,0.82885691757020319,0.78944023491504733,0.75330556121251213,0.71990988289088709,0.68899439666678508,0.66027289363608654,0.56999999999999995,0.56999999999999995,0.56999999999999995,0.56999999999999995,0.56999999999999995,0.56999999999999995,0.56999999999999995,0.56999999999999995,0.56999999999999995,0.56999999999999995,0.56999999999999995,0.56999999999999995,0.56999999999999995,0.56999999999999995,0.56999999999999995,{"$f":"IF(AP17=0,AP28,IF(AP$12>AP$14,AP22,AP22-AP23/2))","v":0.56999999999999995},0.56999999999999995,0.56999999999999995,0.56999999999999995,0.56999999999999995,0.56999999999999995,0.56999999999999995,0.56999999999999995,0.56999999999999995,0.56999999999999995,0.56999999999999995,0.56999999999999995,0.56999999999999995,0.56999999999999995,0.56999999999999995,0.56999999999999995,0.56999999999999995,0.56999999999999995,0.56999999999999995,0.56999999999999995,"I boost diode ON"]
["t rise boost",12,"ns",null,"Enter estimated boost switch rise time",null,null,null,"Vf boost diode",{"$f":"IF(Reset=1,0.45,FORECAST(J51, OFFSET(Vd_1_boost:Vd_3_boost,MATCH(J51,I_Vd1_boost:I_Vd3_boost,1)-1,0,2), OFFSET(I_Vd1_boost:I_Vd3_boost,MATCH(J51,I_Vd1_boost:I_Vd3_boost,1)-1,0,2))+(J50-25)*vd_boost_temp_coeff/1000)","v":0.25537698507320328},{"$f":"IF(Reset=1,0.45,FORECAST(K51, OFFSET(Vd_1_boost:Vd_3_boost,MATCH(K51,I_Vd1_boost:I_Vd3_boost,1)-1,0,2), OFFSET(I_Vd1_boost:I_Vd3_boost,MATCH(K51,I_Vd1_boost:I_Vd3_boost,1)-1,0,2))+(K50-25)*vd_boost_temp_coeff/1000)","v":0.30691907019785192},{"$f":"IF(Reset=1,0.45,FORECAST(L51, OFFSET(Vd_1_boost:Vd_3_boost,MATCH(L51,I_Vd1_boost:I_Vd3_boost,1)-1,0,2), OFFSET(I_Vd1_boost:I_Vd3_boost,MATCH(L51,I_Vd1_boost:I_Vd3_boost,1)-1,0,2))+(L50-25)*vd_boost_temp_coeff/1000)","v":0.30229061535349006},{"$f":"IF(Reset=1,0.45,FORECAST(M51, OFFSET(Vd_1_boost:Vd_3_boost,MATCH(M51,I_Vd1_boost:I_Vd3_boost,1)-1,0,2), OFFSET(I_Vd1_boost:I_Vd3_boost,MATCH(M51,I_Vd1_boost:I_Vd3_boost,1)-1,0,2))+(M50-25)*vd_boost_temp_coeff/1000)","v":0.29836394066348698},{"$f":"IF(Reset=1,0.45,FORECAST(N51, OFFSET(Vd_1_boost:Vd_3_boost,MATCH(N51,I_Vd1_boost:I_Vd3_boost,1)-1,0,2), OFFSET(I_Vd1_boost:I_Vd3_boost,MATCH(N51,I_Vd1_boost:I_Vd3_boost,1)-1,0,2))+(N50-25)*vd_boost_temp_coeff/1000)","v":0.29498792956827946},{"$f":"IF(Reset=1,0.45,FORECAST(O51, OFFSET(Vd_1_boost:Vd_3_boost,MATCH(O51,I_Vd1_boost:I_Vd3_boost,1)-1,0,2), OFFSET(I_Vd1_boost:I_Vd3_boost,MATCH(O51,I_Vd1_boost:I_Vd3_boost,1)-1,0,2))+(O50-25)*vd_boost_temp_coeff/1000)","v":0.29205199894463935},{"$f":"IF(Reset=1,0.45,FORECAST(P51, OFFSET(Vd_1_boost:Vd_3_boost,MATCH(P51,I_Vd1_boost:I_Vd3_boost,1)-1,0,2), OFFSET(I_Vd1_boost:I_Vd3_boost,MATCH(P51,I_Vd1_boost:I_Vd3_boost,1)-1,0,2))+(P50-25)*vd_boost_temp_coeff/1000)","v":0.28947334858116369},{"$f":"IF(Reset=1,0.45,FORECAST(Q51, OFFSET(Vd_1_boost:Vd_3_boost,MATCH(Q51,I_Vd1_boost:I_Vd3_boost,1)-1,0,2), OFFSET(I_Vd1_boost:I_Vd3_boost,MATCH(Q51,I_Vd1_boost:I_Vd3_boost,1)-1,0,2))+(Q50-25)*vd_boost_temp_coeff/1000)","v":0.28718896607252803},{"$f":"IF(Reset=1,0.45,FORECAST(R51, OFFSET(Vd_1_boost:Vd_3_boost,MATCH(R51,I_Vd1_boost:I_Vd3_boost,1)-1,0,2), OFFSET(I_Vd1_boost:I_Vd3_boost,MATCH(R51,I_Vd1_boost:I_Vd3_boost,1)-1,0,2))+(R50-25)*vd_boost_temp_coeff/1000)","v":0.28411859689256225},{"$f":"IF(Reset=1,0.45,FORECAST(S51, OFFSET(Vd_1_boost:Vd_3_boost,MATCH(S51,I_Vd1_boost:I_Vd3_boost,1)-1,0,2), OFFSET(I_Vd1_boost:I_Vd3_boost,MATCH(S51,I_Vd1_boost:I_Vd3_boost,1)-1,0,2))+(S50-25)*vd_boost_temp_coeff/1000)","v":0.28036964737894776},{"$f":"IF(Reset=1,0.45,FORECAST(T51, OFFSET(Vd_1_boost:Vd_3_boost,MATCH(T51,I_Vd1_boost:I_Vd3_boost,1)-1,0,2), OFFSET(I_Vd1_boost:I_Vd3_boost,MATCH(T51,I_Vd1_boost:I_Vd3_boost,1)-1,0,2))+(T50-25)*vd_boost_temp_coeff/1000)","v":0.27697854332817917},{"$f":"IF(Reset=1,0.45,FORECAST(U51, OFFSET(Vd_1_boost:Vd_3_boost,MATCH(U51,I_Vd1_boost:I_Vd3_boost,1)-1,0,2), OFFSET(I_Vd1_boost:I_Vd3_boost,MATCH(U51,I_Vd1_boost:I_Vd3_boost,1)-1,0,2))+(U50-25)*vd_boost_temp_coeff/1000)","v":0.27389409968788708},{"$f":"IF(Reset=1,0.45,FORECAST(V51, OFFSET(Vd_1_boost:Vd_3_boost,MATCH(V51,I_Vd1_boost:I_Vd3_boost,1)-1,0,2), OFFSET(I_Vd1_boost:I_Vd3_boost,MATCH(V51,I_Vd1_boost:I_Vd3_boost,1)-1,0,2))+(V50-25)*vd_boost_temp_coeff/1000)","v":0.27107446003016694},{"$f":"IF(Reset=1,0.45,FORECAST(W51, OFFSET(Vd_1_boost:Vd_3_boost,MATCH(W51,I_Vd1_boost:I_Vd3_boost,1)-1,0,2), OFFSET(I_Vd1_boost:I_Vd3_boost,MATCH(W51,I_Vd1_boost:I_Vd3_boost,1)-1,0,2))+(W50-25)*vd_boost_temp_coeff/1000)","v":0.26848959615712564},{"$f":"IF(Reset=1,0.45,FORECAST(X51, OFFSET(Vd_1_boost:Vd_3_boost,MATCH(X51,I_Vd1_boost:I_Vd3_boost,1)-1,0,2), OFFSET(I_Vd1_boost:I_Vd3_boost,MATCH(X51,I_Vd1_boost:I_Vd3_boost,1)-1,0,2))+(X50-25)*vd_boost_temp_coeff/1000)","v":0.2661006640438901},{"$f":"IF(Reset=1,0.45,FORECAST(Y51, OFFSET(Vd_1_boost:Vd_3_boost,MATCH(Y51,I_Vd1_boost:I_Vd3_boost,1)-1,0,2), OFFSET(I_Vd1_boost:I_Vd3_boost,MATCH(Y51,I_Vd1_boost:I_Vd3_boost,1)-1,0,2))+(Y50-25)*vd_boost_temp_coeff/1000)","v":0.2638891504125222},{"$f":"IF(Reset=1,0.45,FORECAST(Z51, OFFSET(Vd_1_boost:Vd_3_boost,MATCH(Z51,I_Vd1_boost:I_Vd3_boost,1)-1,0,2), OFFSET(I_Vd1_boost:I_Vd3_boost,MATCH(Z51,I_Vd1_boost:I_Vd3_boost,1)-1,0,2))+(Z50-25)*vd_boost_temp_coeff/1000)","v":0.26183458154676564},{"$f":"IF(Reset=1,0.45,FORECAST(AA51, OFFSET(Vd_1_boost:Vd_3_boost,MATCH(AA51,I_Vd1_boost:I_Vd3_boost,1)-1,0,2), OFFSET(I_Vd1_boost:I_Vd3_boost,MATCH(AA51,I_Vd1_boost:I_Vd3_boost,1)-1,0,2))+(AA50-25)*vd_boost_temp_coeff/1000)","v":0.25537698507320328},{"$f":"IF(Reset=1,0.45,FORECAST(AB51, OFFSET(Vd_1_boost:Vd_3_boost,MATCH(AB51,I_Vd1_boost:I_Vd3_boost,1)-1,0,2), OFFSET(I_Vd1_boost:I_Vd3_boost,MATCH(AB51,I_Vd1_boost:I_Vd3_boost,1)-1,0,2))+(AB50-25)*vd_boost_temp_coeff/1000)","v":0.25537698507320328},{"$f":"IF(Reset=1,0.45,FORECAST(AC51, OFFSET(Vd_1_boost:Vd_3_boost,MATCH(AC51,I_Vd1_boost:I_Vd3_boost,1)-1,0,2), OFFSET(I_Vd1_boost:I_Vd3_boost,MATCH(AC51,I_Vd1_boost:I_Vd3_boost,1)-1,0,2))+(AC50-25)*vd_boost_temp_coeff/1000)","v":0.25537698507320328},{"$f":"IF(Reset=1,0.45,FORECAST(AD51, OFFSET(Vd_1_boost:Vd_3_boost,MATCH(AD51,I_Vd1_boost:I_Vd3_boost,1)-1,0,2), OFFSET(I_Vd1_boost:I_Vd3_boost,MATCH(AD51,I_Vd1_boost:I_Vd3_boost,1)-1,0,2))+(AD50-25)*vd_boost_temp_coeff/1000)","v":0.25537698507320328},{"$f":"IF(Reset=1,0.45,FORECAST(AE51, OFFSET(Vd_1_boost:Vd_3_boost,MATCH(AE51,I_Vd1_boost:I_Vd3_boost,1)-1,0,2), OFFSET(I_Vd1_boost:I_Vd3_boost,MATCH(AE51,I_Vd1_boost:I_Vd3_boost,1)-1,0,2))+(AE50-25)*vd_boost_temp_coeff/1000)","v":0.25537698507320328},{"$f":"IF(Reset=1,0.45,FORECAST(AF51, OFFSET(Vd_1_boost:Vd_3_boost,MATCH(AF51,I_Vd1_boost:I_Vd3_boost,1)-1,0,2), OFFSET(I_Vd1_boost:I_Vd3_boost,MATCH(AF51,I_Vd1_boost:I_Vd3_boost,1)-1,0,2))+(AF50-25)*vd_boost_temp_coeff/1000)","v":0.25537698507320328},{"$f":"IF(Reset=1,0.45,FORECAST(AG51, OFFSET(Vd_1_boost:Vd_3_boost,MATCH(AG51,I_Vd1_boost:I_Vd3_boost,1)-1,0,2), OFFSET(I_Vd1_boost:I_Vd3_boost,MATCH(AG51,I_Vd1_boost:I_Vd3_boost,1)-1,0,2))+(AG50-25)*vd_boost_temp_coeff/1000)","v":0.25537698507320328},{"$f":"IF(Reset=1,0.45,FORECAST(AH51, OFFSET(Vd_1_boost:Vd_3_boost,MATCH(AH51,I_Vd1_boost:I_Vd3_boost,1)-1,0,2), OFFSET(I_Vd1_boost:I_Vd3_boost,MATCH(AH51,I_Vd1_boost:I_Vd3_boost,1)-1,0,2))+(AH50-25)*vd_boost_temp_coeff/1000)","v":0.25537698507320328},{"$f":"IF(Reset=1,0.45,FORECAST(AI51, OFFSET(Vd_1_boost:Vd_3_boost,MATCH(AI51,I_Vd1_boost:I_Vd3_boost,1)-1,0,2), OFFSET(I_Vd1_boost:I_Vd3_boost,MATCH(AI51,I_Vd1_boost:I_Vd3_boost,1)-1,0,2))+(AI50-25)*vd_boost_temp_coeff/1000)","v":0.25537698507320328},{"$f":"IF(Reset=1,0.45,FORECAST(AJ51, OFFSET(Vd_1_boost:Vd_3_boost,MATCH(AJ51,I_Vd1_boost:I_Vd3_boost,1)-1,0,2), OFFSET(I_Vd1_boost:I_Vd3_boost,MATCH(AJ51,I_Vd1_boost:I_Vd3_boost,1)-1,0,2))+(AJ50-25)*vd_boost_temp_coeff/1000)","v":0.25537698507320328},{"$f":"IF(Reset=1,0.45,FORECAST(AK51, OFFSET(Vd_1_boost:Vd_3_boost,MATCH(AK51,I_Vd1_boost:I_Vd3_boost,1)-1,0,2), OFFSET(I_Vd1_boost:I_Vd3_boost,MATCH(AK51,I_Vd1_boost:I_Vd3_boost,1)-1,0,2))+(AK50-25)*vd_boost_temp_coeff/1000)","v":0.25537698507320328},{"$f":"IF(Reset=1,0.45,FORECAST(AL51, OFFSET(Vd_1_boost:Vd_3_boost,MATCH(AL51,I_Vd1_boost:I_Vd3_boost,1)-1,0,2), OFFSET(I_Vd1_boost:I_Vd3_boost,MATCH(AL51,I_Vd1_boost:I_Vd3_boost,1)-1,0,2))+(AL50-25)*vd_boost_temp_coeff/1000)","v":0.25537698507320328},{"$f":"IF(Reset=1,0.45,FORECAST(AM51, OFFSET(Vd_1_boost:Vd_3_boost,MATCH(AM51,I_Vd1_boost:I_Vd3_boost,1)-1,0,2), OFFSET(I_Vd1_boost:I_Vd3_boost,MATCH(AM51,I_Vd1_boost:I_Vd3_boost,1)-1,0,2))+(AM50-25)*vd_boost_temp_coeff/1000)","v":0.25537698507320328},{"$f":"IF(Reset=1,0.45,FORECAST(AN51, OFFSET(Vd_1_boost:Vd_3_boost,MATCH(AN51,I_Vd1_boost:I_Vd3_boost,1)-1,0,2), OFFSET(I_Vd1_boost:I_Vd3_boost,MATCH(AN51,I_Vd1_boost:I_Vd3_boost,1)-1,0,2))+(AN50-25)*vd_boost_temp_coeff/1000)","v":0.25537698507320328},{"$f":"IF(Reset=1,0.45,FORECAST(AO51, OFFSET(Vd_1_boost:Vd_3_boost,MATCH(AO51,I_Vd1_boost:I_Vd3_boost,1)-1,0,2), OFFSET(I_Vd1_boost:I_Vd3_boost,MATCH(AO51,I_Vd1_boost:I_Vd3_boost,1)-1,0,2))+(AO50-25)*vd_boost_temp_coeff/1000)","v":0.25537698507320328},{"$f":"IF(Reset=1,0.45,FORECAST(AP51, OFFSET(Vd_1_boost:Vd_3_boost,MATCH(AP51,I_Vd1_boost:I_Vd3_boost,1)-1,0,2), OFFSET(I_Vd1_boost:I_Vd3_boost,MATCH(AP51,I_Vd1_boost:I_Vd3_boost,1)-1,0,2))+(AP50-25)*vd_boost_temp_coeff/1000)","v":0.25537698507320328},{"$f":"IF(Reset=1,0.45,FORECAST(AQ51, OFFSET(Vd_1_boost:Vd_3_boost,MATCH(AQ51,I_Vd1_boost:I_Vd3_boost,1)-1,0,2), OFFSET(I_Vd1_boost:I_Vd3_boost,MATCH(AQ51,I_Vd1_boost:I_Vd3_boost,1)-1,0,2))+(AQ50-25)*vd_boost_temp_coeff/1000)","v":0.25537698507320328},{"$f":"IF(Reset=1,0.45,FORECAST(AR51, OFFSET(Vd_1_boost:Vd_3_boost,MATCH(AR51,I_Vd1_boost:I_Vd3_boost,1)-1,0,2), OFFSET(I_Vd1_boost:I_Vd3_boost,MATCH(AR51,I_Vd1_boost:I_Vd3_boost,1)-1,0,2))+(AR50-25)*vd_boost_temp_coeff/1000)","v":0.25537698507320328},{"$f":"IF(Reset=1,0.45,FORECAST(AS51, OFFSET(Vd_1_boost:Vd_3_boost,MATCH(AS51,I_Vd1_boost:I_Vd3_boost,1)-1,0,2), OFFSET(I_Vd1_boost:I_Vd3_boost,MATCH(AS51,I_Vd1_boost:I_Vd3_boost,1)-1,0,2))+(AS50-25)*vd_boost_temp_coeff/1000)","v":0.25537698507320328},{"$f":"IF(Reset=1,0.45,FORECAST(AT51, OFFSET(Vd_1_boost:Vd_3_boost,MATCH(AT51,I_Vd1_boost:I_Vd3_boost,1)-1,0,2), OFFSET(I_Vd1_boost:I_Vd3_boost,MATCH(AT51,I_Vd1_boost:I_Vd3_boost,1)-1,0,2))+(AT50-25)*vd_boost_temp_coeff/1000)","v":0.25537698507320328},{"$f":"IF(Reset=1,0.45,FORECAST(AU51, OFFSET(Vd_1_boost:Vd_3_boost,MATCH(AU51,I_Vd1_boost:I_Vd3_boost,1)-1,0,2), OFFSET(I_Vd1_boost:I_Vd3_boost,MATCH(AU51,I_Vd1_boost:I_Vd3_boost,1)-1,0,2))+(AU50-25)*vd_boost_temp_coeff/1000)","v":0.25537698507320328},{"$f":"IF(Reset=1,0.45,FORECAST(AV51, OFFSET(Vd_1_boost:Vd_3_boost,MATCH(AV51,I_Vd1_boost:I_Vd3_boost,1)-1,0,2), OFFSET(I_Vd1_boost:I_Vd3_boost,MATCH(AV51,I_Vd1_boost:I_Vd3_boost,1)-1,0,2))+(AV50-25)*vd_boost_temp_coeff/1000)","v":0.25537698507320328},{"$f":"IF(Reset=1,0.45,FORECAST(AW51, OFFSET(Vd_1_boost:Vd_3_boost,MATCH(AW51,I_Vd1_boost:I_Vd3_boost,1)-1,0,2), OFFSET(I_Vd1_boost:I_Vd3_boost,MATCH(AW51,I_Vd1_boost:I_Vd3_boost,1)-1,0,2))+(AW50-25)*vd_boost_temp_coeff/1000)","v":0.25537698507320328},{"$f":"IF(Reset=1,0.45,FORECAST(AX51, OFFSET(Vd_1_boost:Vd_3_boost,MATCH(AX51,I_Vd1_boost:I_Vd3_boost,1)-1,0,2), OFFSET(I_Vd1_boost:I_Vd3_boost,MATCH(AX51,I_Vd1_boost:I_Vd3_boost,1)-1,0,2))+(AX50-25)*vd_boost_temp_coeff/1000)","v":0.25537698507320328},{"$f":"IF(Reset=1,0.45,FORECAST(AY51, OFFSET(Vd_1_boost:Vd_3_boost,MATCH(AY51,I_Vd1_boost:I_Vd3_boost,1)-1,0,2), OFFSET(I_Vd1_boost:I_Vd3_boost,MATCH(AY51,I_Vd1_boost:I_Vd3_boost,1)-1,0,2))+(AY50-25)*vd_boost_temp_coeff/1000)","v":0.25537698507320328},{"$f":"IF(Reset=1,0.45,FORECAST(AZ51, OFFSET(Vd_1_boost:Vd_3_boost,MATCH(AZ51,I_Vd1_boost:I_Vd3_boost,1)-1,0,2), OFFSET(I_Vd1_boost:I_Vd3_boost,MATCH(AZ51,I_Vd1_boost:I_Vd3_boost,1)-1,0,2))+(AZ50-25)*vd_boost_temp_coeff/1000)","v":0.25537698507320328},{"$f":"IF(Reset=1,0.45,FORECAST(BA51, OFFSET(Vd_1_boost:Vd_3_boost,MATCH(BA51,I_Vd1_boost:I_Vd3_boost,1)-1,0,2), OFFSET(I_Vd1_boost:I_Vd3_boost,MATCH(BA51,I_Vd1_boost:I_Vd3_boost,1)-1,0,2))+(BA50-25)*vd_boost_temp_coeff/1000)","v":0.25537698507320328},{"$f":"IF(Reset=1,0.45,FORECAST(BB51, OFFSET(Vd_1_boost:Vd_3_boost,MATCH(BB51,I_Vd1_boost:I_Vd3_boost,1)-1,0,2), OFFSET(I_Vd1_boost:I_Vd3_boost,MATCH(BB51,I_Vd1_boost:I_Vd3_boost,1)-1,0,2))+(BB50-25)*vd_boost_temp_coeff/1000)","v":0.25537698507320328},{"$f":"IF(Reset=1,0.45,FORECAST(BC51, OFFSET(Vd_1_boost:Vd_3_boost,MATCH(BC51,I_Vd1_boost:I_Vd3_boost,1)-1,0,2), OFFSET(I_Vd1_boost:I_Vd3_boost,MATCH(BC51,I_Vd1_boost:I_Vd3_boost,1)-1,0,2))+(BC50-25)*vd_boost_temp_coeff/1000)","v":0.25537698507320328},{"$f":"IF(Reset=1,0.45,FORECAST(BD51, OFFSET(Vd_1_boost:Vd_3_boost,MATCH(BD51,I_Vd1_boost:I_Vd3_boost,1)-1,0,2), OFFSET(I_Vd1_boost:I_Vd3_boost,MATCH(BD51,I_Vd1_boost:I_Vd3_boost,1)-1,0,2))+(BD50-25)*vd_boost_temp_coeff/1000)","v":0.25537698507320328},{"$f":"IF(Reset=1,0.45,FORECAST(BE51, OFFSET(Vd_1_boost:Vd_3_boost,MATCH(BE51,I_Vd1_boost:I_Vd3_boost,1)-1,0,2), OFFSET(I_Vd1_boost:I_Vd3_boost,MATCH(BE51,I_Vd1_boost:I_Vd3_boost,1)-1,0,2))+(BE50-25)*vd_boost_temp_coeff/1000)","v":0.25537698507320328},{"$f":"IF(Reset=1,0.45,FORECAST(BF51, OFFSET(Vd_1_boost:Vd_3_boost,MATCH(BF51,I_Vd1_boost:I_Vd3_boost,1)-1,0,2), OFFSET(I_Vd1_boost:I_Vd3_boost,MATCH(BF51,I_Vd1_boost:I_Vd3_boost,1)-1,0,2))+(BF50-25)*vd_boost_temp_coeff/1000)","v":0.25537698507320328},{"$f":"IF(Reset=1,0.45,FORECAST(BG51, OFFSET(Vd_1_boost:Vd_3_boost,MATCH(BG51,I_Vd1_boost:I_Vd3_boost,1)-1,0,2), OFFSET(I_Vd1_boost:I_Vd3_boost,MATCH(BG51,I_Vd1_boost:I_Vd3_boost,1)-1,0,2))+(BG50-25)*vd_boost_temp_coeff/1000)","v":0.25537698507320328},{"$f":"IF(Reset=1,0.45,FORECAST(BH51, OFFSET(Vd_1_boost:Vd_3_boost,MATCH(BH51,I_Vd1_boost:I_Vd3_boost,1)-1,0,2), OFFSET(I_Vd1_boost:I_Vd3_boost,MATCH(BH51,I_Vd1_boost:I_Vd3_boost,1)-1,0,2))+(BH50-25)*vd_boost_temp_coeff/1000)","v":0.25537698507320328},{"$f":"IF(Reset=1,0.45,FORECAST(BI51, OFFSET(Vd_1_boost:Vd_3_boost,MATCH(BI51,I_Vd1_boost:I_Vd3_boost,1)-1,0,2), OFFSET(I_Vd1_boost:I_Vd3_boost,MATCH(BI51,I_Vd1_boost:I_Vd3_boost,1)-1,0,2))+(BI50-25)*vd_boost_temp_coeff/1000)","v":0.25537698507320328},"Vf boost diode"]
["t fall boost",12,"ns",null,"Enter estimated boost switch fall time",null,null,null,"Pdiss boost diode",{"$f":"J52*J28","v":0.14556488149172586},0.17494387001277559,0.17230565075148932,0.17006744617818756,0.16814311985391928,0.16646963939844442,0.16499980869126329,0.16369771066134095,0.16194760022876048,0.1598106990060002,0.1578777696970621,0.15611963682209562,0.15451244221719515,0.15303906980956161,0.15167737850501734,0.15041681573513765,0.14924571148165641,0.14556488149172586,0.14556488149172586,0.14556488149172586,0.14556488149172586,0.14556488149172586,0.14556488149172586,0.14556488149172586,0.14556488149172586,0.14556488149172586,0.14556488149172586,0.14556488149172586,0.14556488149172586,0.14556488149172586,0.14556488149172586,0.14556488149172586,{"$f":"AP52*AP28","v":0.14556488149172586},0.14556488149172586,0.14556488149172586,0.14556488149172586,0.14556488149172586,0.14556488149172586,0.14556488149172586,0.14556488149172586,0.14556488149172586,0.14556488149172586,0.14556488149172586,0.14556488149172586,0.14556488149172586,0.14556488149172586,0.14556488149172586,0.14556488149172586,0.14556488149172586,0.14556488149172586,0.14556488149172586,0.14556488149172586,"Pdiss boost diode"]
["Max Peak current",{"$f":"IF(Topology=\"Buck\",\"-\",MAX(K22:BI22))","v":1.59425361315285},"A",null,{"$f":"IF(Topology=\"Buck\",\"\",\"Maximum peak MOSFET current\")","v":"Maximum peak MOSFET current"},null,null,"Boost FET","Tj Boost FET",{"$f":"IF(Reset=1,150,IF(Ta+Rthj_a_boost_FET*J59>190,190,Ta+Rthj_a_boost_FET*J59))","v":125},130.95135457844563,130.37250417017606,129.93518903471042,129.59852662150718,129.33522165922,129.12649734733108,128.95911231209118,128.82351529478237,128.71264587255959,128.62124144162559,128.54531131353662,128.4817827386226,128.42826850234152,128.38286082651049,128.34406884332699,128.31068215986593,125,125,125,125,125,125,125,125,125,125,125,125,125,125,125,{"$f":"IF(Reset=1,150,IF(Ta+Rthj_a_boost_FET*AP59>190,190,Ta+Rthj_a_boost_FET*AP59))","v":125},125,125,125,125,125,125,125,125,125,125,125,125,125,125,125,125,125,125,125,"Tj Boost FET","Boost FET"]
["Max RMS current",{"$f":"IF(Topology=\"Buck\",\"-\",MAX(K27:BI27))","v":1.2349259741356222},"A",null,{"$f":"IF(Topology=\"Buck\",\"\",\"Maximum RMS MOSFET current\")","v":"Maximum RMS MOSFET current"},null,null,null,"Rds thermal Coeff",{"$f":"(J54+40)*(1.34655999666222-0.667409045393858)/0.828125/(190)+0.667409045393858/0.828125","v":1.5181259222823451},1.5438140612982683,1.5413155393969005,1.5394279335005394,1.5379747801456507,1.5368382633433562,1.5359373358201962,1.5352148431510484,1.5346295587448076,1.5341510073338416,1.5337564736696891,1.5334287325377947,1.5331545208701205,1.5329235346092955,1.5327275391138562,1.5325600992741379,1.5324159906086696,1.5181259222823451,1.5181259222823451,1.5181259222823451,1.5181259222823451,1.5181259222823451,1.5181259222823451,1.5181259222823451,1.5181259222823451,1.5181259222823451,1.5181259222823451,1.5181259222823451,1.5181259222823451,1.5181259222823451,1.5181259222823451,1.5181259222823451,{"$f":"(AP54+40)*(1.34655999666222-0.667409045393858)/0.828125/(190)+0.667409045393858/0.828125","v":1.5181259222823451},1.5181259222823451,1.5181259222823451,1.5181259222823451,1.5181259222823451,1.5181259222823451,1.5181259222823451,1.5181259222823451,1.5181259222823451,1.5181259222823451,1.5181259222823451,1.5181259222823451,1.5181259222823451,1.5181259222823451,1.5181259222823451,1.5181259222823451,1.5181259222823451,1.5181259222823451,1.5181259222823451,1.5181259222823451,"Rds thermal Coeff"]
["Max Power diss",{"$f":"IF(Topology=\"Buck\",\"-\",MAX(K59:BI59))","v":0.14878386446114067},"W",null,{"$f":"IF(Topology=\"Buck\",\"\",\"Maximum MOSFET power dissipation\")","v":"Maximum MOSFET power dissipation"},null,null,null,"Rds_On Boost FET",{"$f":"R_ds_ON_boost*J55","v":4.4025651746188013E-2},4.4770607777649782E-2,4.4698150642510114E-2,4.4643410071515642E-2,4.4601268624223873E-2,4.4568309636957328E-2,4.4542182738785692E-2,4.4521230451380407E-2,4.4504257203599421E-2,4.4490379212681411E-2,4.447893773642099E-2,4.4469433243596049E-2,4.44614811052335E-2,4.445478250366957E-2,4.4449098634301833E-2,4.4444242878950005E-2,4.444006372765142E-2,4.4025651746188013E-2,4.4025651746188013E-2,4.4025651746188013E-2,4.4025651746188013E-2,4.4025651746188013E-2,4.4025651746188013E-2,4.4025651746188013E-2,4.4025651746188013E-2,4.4025651746188013E-2,4.4025651746188013E-2,4.4025651746188013E-2,4.4025651746188013E-2,4.4025651746188013E-2,4.4025651746188013E-2,4.4025651746188013E-2,{"$f":"R_ds_ON_boost*AP55","v":4.4025651746188013E-2},4.4025651746188013E-2,4.4025651746188013E-2,4.4025651746188013E-2,4.4025651746188013E-2,4.4025651746188013E-2,4.4025651746188013E-2,4.4025651746188013E-2,4.4025651746188013E-2,4.4025651746188013E-2,4.4025651746188013E-2,4.4025651746188013E-2,4.4025651746188013E-2,4.4025651746188013E-2,4.4025651746188013E-2,4.4025651746188013E-2,4.4025651746188013E-2,4.4025651746188013E-2,4.4025651746188013E-2,4.4025651746188013E-2,"Rds_On Boost FET"]
["Max TJ",{"$f":"IF(Topology=\"Buck\",\"-\",IF(ROUNDUP(MAX(K54:BI54),0)>150,\"Too High\",ROUNDUP(MAX(K54:BI54),0)))","v":131},"°C",null,{"$f":"IF(Topology=\"Buck\",\"\",IF(B57>150,\"Boost MOSFET temperature too high, reduce RθJA\",\"Estimated worse case boost MOSFET junction temperature\"))","v":"Estimated worse case boost MOSFET junction temperature"},null,null,null,"Conduction Losses",{"$f":"J27^2*J56","v":0},6.827706446114068E-2,5.3805804254401082E-2,4.2872925867760488E-2,3.4456365537679563E-2,2.78737414804997E-2,2.2655633683277328E-2,1.8471007802279633E-2,1.5081082369559047E-2,1.230934681398977E-2,1.0024236040639376E-2,8.1259828384156775E-3,6.5377684655648447E-3,5.1999125585378376E-3,4.0647206627622903E-3,3.0949210831749713E-3,2.2602539966483804E-3,0,0,0,0,0,0,0,0,0,0,0,0,0,0,0,{"$f":"AP27^2*AP56","v":0},0,0,0,0,0,0,0,0,0,0,0,0,0,0,0,0,0,0,0,"Conduction Losses"]
["Pre-Regulator Buck Diode (based on SS3P4)",null,null,null,null,null,null,null,"Switching Losses",{"$f":"IF(J14=0,0,0.5*Vreg*Iout_PreReg*J19*10^3*(t_rise_boost+t_fall_boost)*10^-9)","v":0},8.0506800000000003E-2,8.0506800000000003E-2,8.0506800000000003E-2,8.0506800000000003E-2,8.0506799999999976E-2,8.0506800000000003E-2,8.0506800000000003E-2,8.0506800000000003E-2,8.0506800000000003E-2,8.0506800000000003E-2,8.0506799999999976E-2,8.0506800000000003E-2,8.0506799999999976E-2,8.0506799999999976E-2,8.0506800000000003E-2,8.0506800000000003E-2,0,0,0,0,0,0,0,0,0,0,0,0,0,0,0,{"$f":"IF(AP14=0,0,0.5*Vreg*Iout_PreReg*AP19*10^3*(t_rise_boost+t_fall_boost)*10^-9)","v":0},0,0,0,0,0,0,0,0,0,0,0,0,0,0,0,0,0,0,0,"Switching Losses"]
["Max Peak current",{"$f":"IF(Topology=\"Buck\",MAX(K80:BI80),MAX(K22:BI22))","v":1.59425361315285},"A",null,"Maximum peak diode current",null,null,null,"Total Boost FET Losses",{"$f":"J57+J58","v":0},0.14878386446114067,0.13431260425440109,0.1233797258677605,0.11496316553767957,0.10838054148049968,0.10316243368327734,9.8977807802279633E-2,9.5587882369559049E-2,9.2816146813989781E-2,9.0531036040639376E-2,8.863278283841565E-2,8.7044568465564853E-2,8.5706712558537818E-2,8.4571520662762273E-2,8.3601721083174971E-2,8.2767053996648382E-2,0,0,0,0,0,0,0,0,0,0,0,0,0,0,0,{"$f":"AP57+AP58","v":0},0,0,0,0,0,0,0,0,0,0,0,0,0,0,0,0,0,0,0,"Total Boost FET Losses"]
["Max Average current",{"$f":"IF(Topology=\"Buck\",MAX(K84:BI84),MAX(K26:BI26))","v":0.47737241384119766},"A",null,"Maximum average diode current",null,null,null,"I_IN",{"$f":"(J61+J62)/J2","v":0.31435218016756328},{"$f":"(K61+K62)/K2","v":1.3471054043935609},1.2136419024860023,1.10573738350826,1.016534745179597,0.94145831530790347,0.87733159075113631,0.82183418690764853,0.77315603957322765,0.73016425089787151,0.69198477117403134,0.65784260577993747,0.62712281725065933,0.5986966675069797,0.57350584590698839,0.55049705231414048,0.52939790818514754,0.49742740163316862,0.4810323034818676,0.46574436177386758,0.45145723323134079,0.43807776282300293,0.42552400199657447,0.41372357364190199,0.40261231505252393,0.39213314528798704,0.3822351148268367,0.37287260419144397,0.36400464500572177,0.3555943422137462,0.34760838030723784,0.34001659965365233,0.33279163158646285,0.32590858296710284,0.31934476256912747,0.31307944295727763,0.30709365260467647,0.30136999386245122,0.29589248310808725,0.29064640998341629,0.28561821311514601,0.28079537010987299,0.27616629994715042,0.27172027617082467,0.26744734951045268,0.26333827875916949,0.25909523144046065,0.2549609364531924,0.25096637606502109,0.24710458548886988,0.24336905515243545,0.13130962797166845]
["max Power diss",{"$f":"MAX(K49:BI49)","v":0.1291303605746362},"W",null,"Maximum diode power dissipation",null,null,null,"Pout",{"$f":"J21*Iout_PreReg","v":3.0494999999999997},3.0494999999999997,3.0494999999999997,3.0494999999999997,3.0494999999999997,3.0494999999999997,3.0494999999999997,3.0494999999999997,3.0494999999999997,3.0494999999999997,3.0494999999999997,3.0494999999999997,3.0494999999999997,3.0494999999999997,3.0494999999999997,3.0494999999999997,3.0494999999999997,3.0494999999999997,3.0494999999999997,3.0494999999999997,3.0494999999999997,3.0494999999999997,3.0494999999999997,3.0494999999999997,3.0494999999999997,3.0494999999999997,3.0494999999999997,3.0494999999999997,3.0494999999999997,3.0494999999999997,3.0494999999999997,3.0494999999999997,{"$f":"AP21*Iout_PreReg","v":3.0494999999999997},3.0494999999999997,3.0494999999999997,3.0494999999999997,3.0494999999999997,3.0494999999999997,3.0494999999999997,3.0494999999999997,3.0494999999999997,3.0494999999999997,3.0494999999999997,3.0494999999999997,3.0494999999999997,3.0494999999999997,3.0494999999999997,3.0494999999999997,3.0494999999999997,3.0494999999999997,3.0494999999999997,3.0494999999999997,"Pout"]
["Max reverse voltage",{"$f":"V_AbsMax+4","v":40},"V",null,"Select a schottkey diode with higher reverse voltage rating",null,null,null,"P loss",{"$f":"J59+J53+J49+J3+J24^2*dcr*10^-3","v":1.1942544322621049},1.6653689153774633,1.5573855890284991,1.4749968447633908,1.4108055145635392,1.3599833339421199,1.3192532274138227,1.2860946390944328,1.2580836490508416,1.234626982308942,1.2153857325419908,1.1996262189663329,1.1867786226524146,1.1719224208910526,1.1640123372758346,1.1578703284009331,1.1532711486535208,1.0466623787547675,1.0540000582738931,1.0614068666775067,1.068895576620601,1.0764772967921625,1.0841617336810119,1.0919574055378172,1.0998718183984633,1.1079116117777426,1.1160826799496106,1.1243902734491253,1.132839084453499,1.1414333189477259,1.1501767579976521,1.1590728099987802,{"$f":"AP59+AP53+AP49+AP3+AP24^2*dcr*10^-3","v":1.1681245554121138},1.1773347852162035,1.1867060340802653,1.1962406090839004,1.2059406146648053,1.215807974359389,1.2258444498066512,1.2360516574085387,1.2464310829767906,1.2569840946442796,1.2677119542758646,1.2786158275781385,1.2896967930777552,1.3009558501132212,1.3075300144273418,1.3134539840000403,1.3193636486421045,1.3252597532978516,{"$f":"BH59+BH53+BH49+BH3+BH24^2*dcr*10^-3","v":1.331142992743841},1.6776466069800642,"P loss"]
["Max TJ",{"$f":"IF(Topology=\"Buck\",ROUNDUP(MAX(K106:BI106),0),ROUNDUP(MAX(K46:BI46),0))","v":136},"°C",null,{"$f":"IF(B63>150,\"Buck diode temperature too high, reduce RθJA\",\"Estimated worse case buck diode temperature\")","v":"Estimated worse case buck diode temperature"},null,null,null,"Efficiency",{"$f":"J61/(J61+J62)","v":0.71858540560615913},0.64678362319981131,0.66194394044916549,0.67399759677796256,0.68369756063636089,0.69157762237729514,0.6980252354068569,0.70336372605095354,0.7079375001044832,0.71181363498158112,0.71502501854426315,0.71767696294553451,0.71985350153636729,0.72238683930529635,0.72374298587472397,0.72479952131026293,0.72559268447842939,0.7444773224363842,0.74314608424369066,0.7418071240481906,0.74045825449878322,0.73909761994349921,0.73772364466901619,0.73633499065384844,0.73493052285129223,0.73350928047656305,0.73207045311531027,0.73061336072929939,0.7291374368318283,0.72764221425638886,0.72612731305872202,0.72459243018321073,{"$f":"AP61/(AP61+AP62)","v":0.72303733059568798},0.72146183964084543,0.71986583642693047,0.71824924807594115,0.71661204470602269,0.71495423503574962,0.71327586251861197,0.71157700193118767,0.70985775635090076,0.70811825446945997,0.70635864819648386,0.70457911051479249,0.70277983355463713,0.70096102685897532,0.69990337222884735,0.69895305134622565,0.6980075931066928,0.69706684983127964,0.69613068333832151,0.64510374937327608,"Efficiency"]
["Pre-Regulator Boost Diode (based on SS3P4)",null,null,null,null,null,null,null,null,null,null,null,{"$f":"M57/M61","v":1.4059001760210032E-2}]
["Max Peak current",{"$f":"IF(Topology=\"Buck\",\"-\",MAX(K22:BI22))","v":1.59425361315285},"A",null,{"$f":"IF(Topology=\"Buck\",\"\",\"Maximum peak diode current\")","v":"Maximum peak diode current"},null,null,"Buck Only Mode Calculations",null,{"$f":"Vin_nom","v":13.5},{"$f":"Vin_min_buck","v":6.5},{"$f":"K65+(Vin_max_buck-Vin_min_buck)/49","v":6.7346938775510203},6.9693877551020407,7.204081632653061,7.4387755102040813,7.6734693877551017,7.908163265306122,8.1428571428571423,8.3775510204081627,8.612244897959183,8.8469387755102034,9.0816326530612237,9.316326530612244,9.5510204081632644,9.7857142857142847,10.020408163265305,10.255102040816325,10.489795918367346,10.724489795918366,10.959183673469386,11.193877551020407,11.428571428571427,11.663265306122447,11.897959183673468,12.132653061224488,12.367346938775508,12.602040816326529,12.836734693877549,13.071428571428569,13.30612244897959,13.54081632653061,13.77551020408163,14.010204081632651,{"$f":"AQ65+(Vin_max_buck-Vin_min_buck)/49","v":14.244897959183671},14.479591836734691,14.714285714285712,14.948979591836732,15.183673469387752,15.418367346938773,15.653061224489793,15.887755102040813,16.122448979591834,16.357142857142854,16.591836734693874,16.826530612244895,17.061224489795915,17.295918367346935,17.530612244897956,17.765306122448976,17.999999999999996,{"$f":"BI2","v":36},null,"Buck Only Mode Calculations"]
["Max Average current",{"$f":"IF(Topology=\"Buck\",\"-\",MAX(K28:BH28))","v":0.56999999999999995},"A",null,{"$f":"IF(Topology=\"Buck\",\"\",\"Maximum average diode current\")","v":"Maximum average diode current"},null,null,"Buck","Pdiss total",{"$f":"J89+J93+J97+J101+J105+IF(J77<5,J2*Icc,J77*Icc)","v":0.95348594377105778},0.82769808222389751,0.82925621511210668,0.8310646353043758,0.82966462247761363,0.83204624582782838,0.83463869881152253,0.83743418478942044,0.84042580662159361,0.84360743992789933,0.84697362728484127,0.85051948941676503,0.85424065026806228,0.85813317348029772,0.8621935082919836,0.86641844326409057,0.87080506653736678,0.87535073156701648,0.88005302747108372,0.88490975328146548,0.88991889550941039,0.89507860853674215,0.90038719742499773,0.90584310280066882,0.91144488752906805,0.91719122493401084,0.92308088835758817,0.9291127418850339,0.93528573208544552,0.94159888064056196,0.94805127775193299,0.95464207623202468,{"$f":"AP89+AP93+AP97+AP101+AP105+IF(AP77<5,AP2*Icc,AP77*Icc)","v":0.9613704861977348},0.96823577029570684,0.97523723939817686,0.98237424871601475,0.98964619428246048,0.99705250976686544,1.0045926635828129,1.0122661562593054,1.0200725180474788,1.0280113067385368,1.0360821056714489,1.0442845219114001,1.0526181845821319,1.0610827433371997,1.0696778669568092,1.078403242058338,1.0872585719099468,1.0962435753377389,1.1053579857180109,1.3725928590658014,"Pdiss total","Buck"]
["max Power diss",{"$f":"IF(Topology=\"Buck\",\"-\",MAX(K53:BI53))","v":0.17494387001277559},"W",null,{"$f":"IF(Topology=\"Buck\",\"\",\"Maximum diode power dissipation\")","v":"Maximum diode power dissipation"},null,null,null,"Tj",{"$f":"IF(Reset=1,150,Ta+Rth_ja*J66)","v":153.60457831313173},149.83094246671692,149.8776864533632,149.93193905913128,149.88993867432842,149.96138737483486,150.03916096434568,150.12302554368262,150.21277419864782,150.30822319783698,150.40920881854524,150.51558468250295,150.62721950804186,150.74399520440892,150.8658052487595,150.99255329792271,151.12415199612101,151.26052194701049,151.40159082413251,151.54729259844396,151.69756686528231,151.85235825610226,152.01161592274994,152.17529308402007,152.34334662587204,152.51573674802032,152.69242665072764,152.87338225655103,153.05857196256338,153.24796641921685,153.441538332558,153.63926228696073,{"$f":"IF(Reset=1,150,Ta+Rth_ja*AP66)","v":153.84111458593205},154.04707310887122,154.25711718194532,154.47122746148045,154.6893858284738,154.91157529300597,155.1377799074844,155.36798468777917,155.60217554142437,155.84033920215612,156.08246317014346,156.328535657342,156.57854553746395,156.832482300116,157.09033600870427,157.35209726175015,157.6177571572984,157.88730726013216,158.16073957154032,166.17778577197404,"Tj"]
["Max reverse voltage",{"$f":"IF(Topology=\"Buck\",\"-\",Vreg+4)","v":9.35},"V",null,{"$f":"IF(Topology=\"Buck\",\"\",\"Select a schottkey diode with higher reverse voltage rating\")","v":"Select a schottkey diode with higher reverse voltage rating"},null,null,null,null,null,{"$f":"K65","v":6.5},{"$f":"L65","v":6.7346938775510203},6.9693877551020407,7.204081632653061,7.4387755102040813,7.6734693877551017,7.908163265306122,8.1428571428571423,8.3775510204081627,8.612244897959183,8.8469387755102034,9.0816326530612237,9.316326530612244,9.5510204081632644,9.7857142857142847,10.020408163265305,10.255102040816325,10.489795918367346,10.724489795918366,10.959183673469386,11.193877551020407,11.428571428571427,11.663265306122447,11.897959183673468,12.132653061224488,12.367346938775508,12.602040816326529,12.836734693877549,13.071428571428569,13.30612244897959,13.54081632653061,13.77551020408163,14.010204081632651,14.244897959183671,14.479591836734691,14.714285714285712,14.948979591836732,15.183673469387752,15.418367346938773,15.653061224489793,15.887755102040813,16.122448979591834,16.357142857142854,16.591836734693874,16.826530612244895,17.061224489795915,17.295918367346935,17.530612244897956,17.765306122448976,17.999999999999996,36]
["Max TJ",{"$f":"IF(Topology=\"Buck\",\"-\",ROUNDUP(MAX(K50:BI50),0))","v":140},"°C",null,{"$f":"IF(Topology=\"Buck\",\"\",IF(B69>150,\"Boost diode temperature too high, reduce RθJA\",\"Estimated worse case boost diode temperature\"))","v":"Estimated worse case boost diode temperature"},null,null,null,"V1",{"$f":"IF(Reset=1,J2-Vreg,J2-Iout_PreReg*(J86+dcr*10^-3)-Vreg)","v":8.0121186265060604},{"$f":"IF(Reset=1,K65-Vreg,K65-Iout_PreReg*(K86+dcr*10^-3)-Vreg)","v":1.005517368452959},1.2401974243213125,1.4748752599735857,1.7173146510507626,1.9519870939916313,2.1866576394657979,2.421326357643018,2.6559933105975482,2.8906585534488123,3.1253221353136205,3.3599841001054536,3.5946444872088108,3.8293033320509213,4.0639606665886365,4.2986165197249075,4.5332709176664689,4.7679238842322231,5.002575441120106,5.237225608138834,5.4718744034098012,5.7065218435435767,5.9411679437946017,6.1758127181972409,6.4104561796857062,6.6450983402000823,6.8797392107802899,7.114378801649563,7.3490171222887799,7.5836541815028049,7.8182899874798224,8.0529245478445226,8.2875578697058518,{"$f":"IF(Reset=1,AQ65-Vreg,AQ65-Iout_PreReg*(AQ86+dcr*10^-3)-Vreg)","v":8.5221899596999897},8.7568208240290879,8.9914504684962484,9.2260788985371693,9.4607061192488313,9.6953321354155069,9.9299569515324393,10.164580571827367,10.399203000280167,10.633824240640791,10.86844429644565,11.103063171032636,11.337680867554861,11.572297388993304,11.806912738168412,12.041526917750767,12.276139930270938,12.510751778128535,30.508346664268409,"V1"]
["Pre-Regulator Compensation Components",null,null,null,null,null,null,null,"V3",{"$f":"IF(Reset=1,Vreg,Vreg+J108+Iout_PreReg*dcr*10^-3)","v":5.6148440785334097},5.6232032491204054,5.6226288684320966,5.6220948400383373,5.6215811725615028,5.6211171120270071,5.6206825304563983,5.6202747095160053,5.6198912546605628,5.6195300483816801,5.6191892113192825,5.6188670697370835,5.618562128180689,5.6182730463808328,5.6179986196529637,5.6177377621915001,5.6174894927724424,5.6172529224691452,5.6170272440584004,5.6168117228517804,5.6166056887336033,5.6164085292243939,5.6162196834190627,5.616038636673875,5.6158649159365348,5.6156980856304086,5.6155377440177299,5.6153835199780016,5.6152350701473779,5.615092076372715,5.6149542434406596,5.6148212970477429,{"$f":"IF(Reset=1,Vreg,Vreg+AP108+Iout_PreReg*dcr*10^-3)","v":5.6146929819821683},5.6145690604919976,5.6144493108178102,5.6143335258708404,5.6142215120400349,5.6141130881136068,5.6140080843024673,5.6139063413544923,5.6138077097499188,5.6137120489693269,5.6136192268266951,5.61352911886088,5.6134416077796212,5.6133565829508827,5.6132739399368781,5.6131935800666684,5.6131154100436538,5.6130393415846864,5.6129652910878711,5.6101869682838776,"V3"]
["fcMAX",{"$f":"IF(ROUNDDOWN(fsw/10,0)>40,40,ROUNDDOWN(fsw/10,0))","v":40},"kHz",null,"Recommended maximum 0dB crossover frequency",null,null,null,"Required Buck duty",{"$f":"IF(Reset=1,Vreg/J2,J70/(J69+J70))","v":0.41203929298617287},{"$f":"IF(Reset=1,Vreg/K65,K70/(K69+K70))","v":0.84830898351829198},0.81928765621958688,0.79218240471787982,0.76599822475672008,0.74224742709332958,0.7199228428793325,0.69889996563850487,0.6790683473586232,0.66032967203252724,0.64259613700232276,0.62578908631532892,0.60983785154623471,0.59467876430266386,0.58025431150452522,0.5665124099525245,0.55340578100882853,0.540891409652692,0.52893007493565969,0.51748594108982593,0.50652620035032347,0.49602076002622481,0.48594196755976249,0.47626436830497659,0.46696449157513292,0.45802066118637363,0.44941282728922938,0.44112241675067237,0.43313219974411804,0.42542617053663434,0.417989440742559,0.41080814354958478,0.40386934762441212,{"$f":"IF(Reset=1,Vreg/AQ65,AQ70/(AQ69+AQ70))","v":0.39716097957619051},0.39067175400204268,0.38439111026399414,0.3783091552539315,0.37241661149552707,0.36670477001169471,0.36116544745497642,0.35579094705791681,0.35057402301228313,0.34550784793108735,0.34058598308669097,0.33580235115264734,0.33115121120704061,0.32662713578148528,0.3222249897631721,0.31793991097778845,0.3137672922991761,0.30970276514753342,0.15532709675753906,"Required Buck duty"]
["fc =",35,"kHz",null,"Choose fc considering recommended fcMAX",null,null,null,"ton buck",{"$f":"J71/(fsw*10^3)*10^6","v":0.18729058772098767},0.38559499250831453,0.37240348009981222,0.36008291123539993,0.34818101125305456,0.33738519413333162,0.32723765585424208,0.31768180256295681,0.30866743061755603,0.30014985092387603,0.29208915318287398,0.28444958468878589,0.27719902343010666,0.27030852922848358,0.26375195977478416,0.2575056408875111,0.25154808227674025,0.24585973166031452,0.24042276133439075,0.23522088231355723,0.23023918197741977,0.22546398183010219,0.22088271252716477,0.21648380377498935,0.21225658707960587,0.20819120963016982,0.20427855785874061,0.20051018943212379,0.19687827261096275,0.1933755320621065,0.18999520033752682,0.18673097434072033,{"$f":"AP71/(fsw*10^3)*10^6","v":0.1835769761929146},0.18052771798917752,0.17757807000092851,0.17472323193817915,0.17195870693360524,0.1692802779525123,0.16668398636895213,0.16416611247953472,0.16172315775359855,0.15935182864194689,0.1570490217868579,0.15481181049395043,0.15263743234211241,0.15052327782138208,0.14846687990067514,0.14646590443780549,0.14451814135354021,0.14262149649962549,0.14077398415796974,{"$f":"IF(BI71>1,1000/fsw,IF(BI71*1000/fsw<0.16,0.16,BI71*1000/fsw))","v":0.16},"ton buck"]
["R_LOAD",{"$f":"Vreg/Iout_PreReg","v":9.3859649122807021},"Ω",null,null,null,null,null,"toff buck",{"$f":"1/(fsw*10^-3)-J72","v":0.26725486682446686},6.8950462037140003E-2,8.2141974445642307E-2,9.4462543310054603E-2,0.10636444329239997,0.11716026041212291,0.12730779869121245,0.13686365198249772,0.1458780239278985,0.1543956036215785,0.16245630136258055,0.17009586985666864,0.17734643111534787,0.18423692531697095,0.19079349477067037,0.19703981365794343,0.20299737226871428,0.20868572288514001,0.21412269321106378,0.2193245722318973,0.22430627256803476,0.22908147271535234,0.23366274201828977,0.23806165077046518,0.24228886746584866,0.24635424491528471,0.25026689668671392,0.25403526511333074,0.25766718193449178,0.26116992248334803,0.26455025420792772,0.2678144802047342,{"$f":"1/(fsw*10^-3)-AP72","v":0.2709684783525399},0.27401773655627704,0.27696738454452602,0.27982222260727541,0.28258674761184932,0.28526517659294226,0.28786146817650238,0.29037934206591981,0.29282229679185601,0.29519362590350762,0.29749643275859661,0.2997336440515041,0.30190802220334212,0.30402217672407245,0.30607857464477939,0.30807955010764904,0.31002731319191434,0.31192395804582906,0.31377147038748476,{"$f":"BI72/BI71-BI72","v":0.87008427595704829},"toff buck"]
["fP1",{"$f":"wp/(2*PI())","v":0.65970247266370619},"kHz",null,"Dominant pole formed by Co and RLOAD.",null,null,null,"Actual fsw",{"$f":"1/(J72+J73)*10^3","v":2200},2200,2200,2200,2200,2200,2200,2200,2200,2200,2200,2200,2200,2200,2200,2200,2200,2200,2200,2200,2200,2200,2200,2200,2200,2200,2200,2200,2200,2200,2200,2200,{"$f":"1/(AP72+AP73)*10^3","v":2200},2199.9999999999995,2200,2199.9999999999995,2199.9999999999995,2199.9999999999995,2200,2200,2199.9999999999995,2200,2200,2200,2200,2200,2200,2200,2199.9999999999995,2199.9999999999995,2200,970.79435473461911,"Actual fsw"]
["fZ1",{"$f":"wz/(2*PI())","v":3183.098861837907},"kHz",null,"Zero formed by the output capacitance and its ESR",null,null,null,"VREG_actual",{"$f":"J69*J71/(1-J71)-J108-Iout_PreReg*dcr*10^-3","v":5.3499999999999988},5.35,5.3500000000000023,5.35,5.349999999999997,5.3499999999999988,5.35,5.3500000000000005,5.3500000000000014,5.3500000000000014,5.3500000000000005,5.35,5.3500000000000005,5.349999999999997,5.3500000000000005,5.3499999999999988,5.3500000000000005,5.3500000000000005,5.3499999999999988,5.3500000000000005,5.35,5.3499999999999988,5.35,5.3499999999999979,5.3500000000000014,5.3499999999999988,5.3500000000000014,5.35,5.35,5.3500000000000005,5.35,5.3499999999999988,{"$f":"AP69*AP71/(1-AP71)-AP108-Iout_PreReg*dcr*10^-3","v":5.3500000000000005},5.3499999999999988,5.35,5.3499999999999988,5.35,5.35,5.3500000000000005,5.3499999999999979,5.35,5.3500000000000005,5.35,5.35,5.3499999999999988,5.35,5.3500000000000014,5.35,5.3500000000000005,5.35,5.3500000000000005,5.35,"VREG_actual"]
["fP2",{"$f":"IF(fz_1>10*fc,MAX(fsw/2,5*fc),fz_1)","v":1100},"kHz",null,null,null,null,null,"New duty cycle",{"$f":"IF(J73*10^-6<0,(1/(J74*10^3))*(J74*10^3),J71)","v":0.41203929298617287},0.84830898351829198,0.81928765621958688,0.79218240471787982,0.76599822475672008,0.74224742709332958,0.7199228428793325,0.69889996563850487,0.6790683473586232,0.66032967203252724,0.64259613700232276,0.62578908631532892,0.60983785154623471,0.59467876430266386,0.58025431150452522,0.5665124099525245,0.55340578100882853,0.540891409652692,0.52893007493565969,0.51748594108982593,0.50652620035032347,0.49602076002622481,0.48594196755976249,0.47626436830497659,0.46696449157513292,0.45802066118637363,0.44941282728922938,0.44112241675067237,0.43313219974411804,0.42542617053663434,0.417989440742559,0.41080814354958478,{"$f":"IF(AP73*10^-6<0,(1/(AP74*10^3))*(AP74*10^3),AP71)","v":0.40386934762441212},0.39716097957619051,0.39067175400204268,0.38439111026399414,0.3783091552539315,0.37241661149552707,0.36670477001169471,0.36116544745497642,0.35579094705791681,0.35057402301228313,0.34550784793108735,0.34058598308669097,0.33580235115264734,0.33115121120704061,0.32662713578148528,0.3222249897631721,0.31793991097778845,0.3137672922991761,0.30970276514753342,0.15532709675753906,"New duty cycle"]
["Rz",{"$f":"fc*10^3*Vreg/VFB*2*PI()*Number_Cout*Co*10^-6/(gm_POWER1*gm_EA1*10^-6)*10^-3","v":17.878167529318283},"kΩ",null,"Recommended compensation resister to achieve chosen fc",null,null,null,"New VREG",{"$f":"(J2-Iout_PreReg*J86+J108)*J76-J108-Iout_PreReg*dcr*10^-3","v":5.35},{"$f":"(K65-Iout_PreReg*K86+K108)*K76-K108-Iout_PreReg*dcr*10^-3","v":5.35},5.35,5.35,5.3499999999999988,5.35,5.35,5.35,5.35,5.3499999999999988,5.3499999999999988,5.3499999999999988,5.3500000000000005,5.3499999999999988,5.3500000000000014,5.35,5.3499999999999988,5.3499999999999988,5.3500000000000005,5.3499999999999988,5.3500000000000005,5.3499999999999988,5.35,5.35,5.3500000000000005,5.3499999999999988,5.3500000000000005,5.3500000000000005,5.3500000000000005,5.35,5.35,5.3499999999999988,5.35,{"$f":"(AQ65-Iout_PreReg*AQ86+AQ108)*AQ76-AQ108-Iout_PreReg*dcr*10^-3","v":5.3499999999999988},5.35,5.3499999999999988,5.35,5.35,5.35,5.3499999999999988,5.3499999999999988,5.3500000000000005,5.35,5.35,5.35,5.35,5.3500000000000014,5.3499999999999988,5.35,5.3499999999999979,5.3500000000000005,5.3500000000000005,"New VREG"]
["Actual Rz used",18.2,"kΩ",null,"Enter the closest available 1% standard resister value",null,null,null,"New V1",{"$f":"IF(Reset=1,J2,J2-Iout_PreReg*(J86+dcr*10^-3)-J77)","v":8.0121186265060604},{"$f":"IF(Reset=1,K65,K65-Iout_PreReg*(K86+dcr*10^-3)-K77)","v":1.005517368452959},1.2401974243213125,1.4748752599735857,1.7173146510507635,1.9519870939916313,2.1866576394657979,2.421326357643018,2.6559933105975482,2.8906585534488132,3.1253221353136214,3.3599841001054545,3.5946444872088099,3.8293033320509222,4.0639606665886348,4.2986165197249075,4.5332709176664698,4.767923884232224,5.0025754411201051,5.2372256081388349,5.4718744034098004,5.7065218435435776,5.9411679437946017,6.1758127181972409,6.4104561796857054,6.6450983402000832,6.879739210780289,7.1143788016495622,7.349017122288779,7.5836541815028049,7.8182899874798224,8.0529245478445226,8.2875578697058518,{"$f":"IF(Reset=1,AQ65,AQ65-Iout_PreReg*(AQ86+dcr*10^-3)-AQ77)","v":8.5221899596999897},8.7568208240290879,8.9914504684962502,9.2260788985371693,9.4607061192488313,9.6953321354155069,9.9299569515324393,10.164580571827369,10.399203000280167,10.633824240640791,10.86844429644565,11.103063171032636,11.337680867554861,11.572297388993302,11.806912738168414,12.041526917750767,12.27613993027094,12.510751778128533,30.508346664268409,"New V1"]
["Cz (min)",{"$f":"4/(2*PI()*Rz*10^3*fc*10^3)*10^9","v":0.99940309633843227},"nF",null,"Recommended range for the compensation capacitor, Cz(min) to Cz(max).",null,null,null,"Vin - VREG",{"$f":"J2-J77","v":8.15},{"$f":"K65-K77","v":1.1500000000000004},1.3846938775510207,1.619387755102041,1.8540816326530623,2.0887755102040817,2.323469387755102,2.5581632653061224,2.7928571428571427,3.0275510204081639,3.2622448979591843,3.4969387755102046,3.7316326530612232,3.9663265306122453,4.2010204081632629,4.4357142857142851,4.6704081632653063,4.9051020408163266,5.1397959183673452,5.3744897959183673,5.6091836734693858,5.843877551020408,6.0785714285714274,6.3132653061224477,6.5479591836734672,6.7826530612244893,7.0173469387755079,7.2520408163265282,7.4867346938775485,7.7214285714285698,7.9561224489795901,8.1908163265306122,8.4255102040816308,{"$f":"AQ65-AQ77","v":8.6602040816326529},8.8948979591836714,9.1295918367346935,9.3642857142857121,9.5989795918367324,9.8336734693877528,10.068367346938775,10.303061224489795,10.537755102040812,10.772448979591834,11.007142857142854,11.241836734693875,11.476530612244895,11.711224489795914,11.945918367346938,12.180612244897956,12.415306122448978,12.649999999999995,30.65]
["Cz (max)",{"$f":" 0.6 *1/(2*PI()*Rz*10^3*1.5*fp_1*10^3)*10^9","v":5.3022551561173676},"nF",null,"  Note:  Higher values of Cz will have more phase margin, but recover from a transient more slowly.",null,null,"Circuit Currents","Ilpk",{"$f":"Iout_PreReg+J81/2","v":0.64502972032242956},0.58938612310777994,0.59309269184140401,0.5965538688660178,0.59989681759212699,0.60292857723260618,0.6057778360047279,0.60846056609446153,0.61099093154597806,0.61338153669447437,0.6156436347963723,0.61778730409179594,0.61982159707163487,0.62175466758282072,0.62359387951301948,0.62534590009207025,0.62701678028899588,0.62861202433770691,0.63013665006688513,0.63159524142107859,0.63299199432621267,0.63433075686228946,0.63561506455023942,0.63684817143186467,0.63803307751617278,0.63917255307788445,0.64026916022112135,0.64132527206053191,0.64234308982123012,0.64332465811615613,0.6442718786234054,0.64518652235556562,{"$f":"Iout_PreReg+AP81/2","v":0.64607024068721963},0.6469245752847459,0.64775096706375124,0.64855076428338598,0.64932522987299357,0.65007554807467383,0.65080283047510301,0.65150812149111059,0.65219240336583995,0.6528566007256732,0.65350158474230058,0.65412817693926995,0.65473715267793464,0.65532924435385642,0.65590514433132818,0.6564655076407041,0.65701095446059821,0.65754207240470242,0.65805941863092787,0.81406677331414723,"Ilpk","Circuit Currents"]
["Actual Cz used",1.5,"nF",null,"Enter actual Cz.",null,null,null,"ΔIL",{"$f":"J78*J76/(L_buck*10^-6*J74*10^3)","v":0.15005944064485924},3.8772246215559886E-2,4.6185383682808029E-2,5.3107737732035608E-2,5.9793635184254137E-2,6.5857154465212439E-2,7.1555672009455798E-2,7.6921132188923255E-2,8.1981863091956153E-2,8.6763073388948841E-2,9.1287269592744705E-2,9.5574608183592036E-2,9.9643194143269873E-2,0.10350933516564162,0.10718775902603907,0.1106918001841405,0.1140335605779919,0.11722404867541392,0.12027330013377036,0.12319048284215732,0.12598398865242541,0.12866151372457904,0.13123012910047896,0.13369634286372953,0.13606615503234565,0.13834510615576889,0.14053832044224279,0.14265054412106395,0.14468617964246031,0.14664931623231239,0.14854375724681088,0.15037304471113128,{"$f":"AP78*AP76/(L_buck*10^-6*AP74*10^3)","v":0.15214048137443933},0.153849150569492,0.15550193412750257,0.15710152856677204,0.15865045974598727,0.16015109614934767,0.1616056609502062,0.16301624298222123,0.16438480673168007,0.16571320145134649,0.16700316948460131,0.16825635387854004,0.16947430535586941,0.17065848870771286,0.17181028866265649,0.17293101528140833,0.17402190892119651,0.17508414480940498,0.17611883726185579,0.4881335466282945,"ΔIL"]
["Cp",{"$f":"IF(1/(2*PI()*Rz*10^3*fc*10*10^3)*10^12>68,1/(2*PI()*Rz*10^3*fc*10*10^3)*10^12,68)","v":68},"pF",null,"Recommended HF compensation capacitor.  Sets the high frequency roll-off of the gain.",null,null,null,"IL RMS",{"$f":"SQRT((J80-J81/2)^2+J81^2/12)","v":0.57164367075176648},0.57010987881552266,0.57015590628543056,0.57020613464247982,0.57026129090155886,0.57031695608628119,0.57037416185903245,0.5704323550735606,0.57049109150771937,0.57055001467180011,0.57060883898908787,0.57066733637977496,0.57072532550979027,0.57078266313796655,0.5708392371240949,0.57089496075810686,0.57094976814501042,0.57100361043720316,0.57105645274971628,0.57110827162798738,0.57115905296428993,0.57120879027972338,0.57125748330501314,0.57130513680629658,0.5713517596123312,0.57139736380774253,0.57144196406347969,0.57148557708091197,0.57152822113023793,0.57156991566732263,0.57161068101586121,0.57165053810404243,{"$f":"SQRT((AP80-AP81/2)^2+AP81^2/12)","v":0.57168950824674392},0.57172761296580676,0.57176487384219643,0.57180131239487497,0.57183694998207402,0.57187180772135149,0.57190590642540373,0.57193926655109384,0.57197190815955656,0.57200385088558436,0.57203511391477702,0.57206571596717948,0.57209567528632932,0.57212500963280155,0.57215373628148414,0.57218187202193116,0.57220943316124628,0.57223643552903025,0.57226289448399992,0.58715943031854056,"IL RMS"]
["Actual Cp used",68,"pF",null,"Enter actual Cp.  Do not use significantly less than the recommended value.",null,null,null,"Isw buck RMS",{"$f":"SQRT(J76*((J80-J81/2)^2+J81^2/12))","v":0.36693971219248872},0.52509223926793747,0.51607382612227659,0.50750985671588134,0.49910023508157975,0.49134963096225148,0.48395259228725068,0.47688280178725195,0.47011662636484763,0.46363277273364956,0.4574119958601166,0.4514368508551867,0.44569148083055699,0.44016143468929647,0.43483350996203934,0.42969561670198375,0.42473665916928205,0.41994643260947789,0.41531553289276679,0.41083527715491908,0.40649763388511467,0.40229516115489888,0.39822095188706857,0.39426858523220626,0.39043208326063261,0.38670587229415848,0.38308474829950123,0.37956384584702529,0.37613861020736333,0.37280477221669395,0.36955832559082857,0.36639550641026197,{"$f":"SQRT(AP76*((AP80-AP81/2)^2+AP81^2/12))","v":0.36331277453418603},0.36030679673214588,0.35737443134835573,0.35451271433635151,0.35171884652123431,0.34899018196367154,0.3463242173145174,0.3437185820616756,0.34117102958195639,0.33867942892039682,0.33624175722802319,0.33385609279649536,0.33152060863463156,0.329233566537593,0.3269933116046001,0.32479826716556276,0.32264693008099615,0.32053786638313431,0.31846970722930018,0.23140868416918198,"Isw buck RMS"]
["Estimated cross over",{"$f":"'Control Loop'!$B$25","v":31.992671377973799},"kHz",null,null,null,null,null,"I buck Diode avg",{"$f":"(J80-J81/2)*(1-J76)","v":0.33513760299788142},8.6463879394573562E-2,0.10300603595483547,0.11845602931080849,0.13338101188866955,0.14691896655680212,0.15964397955878046,0.1716270195860522,0.18293104200558477,0.19361208694145945,0.20372020190867601,0.21330022080026251,0.2223924246186462,0.23103310434748159,0.2392550424424206,0.247087926327061,0.25455870482496773,0.26169189649796554,0.26850985728667398,0.27503301357879922,0.28128006580031562,0.28726816678505185,0.29301307849093533,0.29852931006616334,0.30383023980217416,0.30892822312376705,0.31383468844513923,0.31856022245211668,0.32311464614585272,0.32750708279411839,0.33174601877674131,0.33583935817673666,{"$f":"(AP80-AP81/2)*(1-AP76)","v":0.33979447185408501},0.34361824164157129,0.34731710021883566,0.35089706714952335,0.35436378150525899,0.35772253144754956,0.36097828109333396,0.36413569495066345,0.36719916017698739,0.37017280688299858,0.37306052667928019,0.3758659896405861,0.37859265984299101,0.38124380961198684,0.38382253260455335,0.38633175583499185,0.38877425074266053,0.39115264338946959,0.39346942386590589,0.48146355484820269,"I buck Diode avg"]
["Estimated phase margin",{"$f":"'Control Loop'!$B$26","v":62.328764878725991},"deg",null,"Phase margin should be at least 50 deg.  If not, reduce the chosen crossove frequency, and/or increase Cz.",null,null,null,"I cout RMS",{"$f":"SQRT(((J80-J81/2-Iout_PreReg)^2+J81^2/12))","v":4.3318429225377077E-2},1.1192583394819974E-2,1.3332571850947682E-2,1.5330883337821401E-2,1.7260935684727703E-2,1.9011322929276583E-2,2.0656343248351937E-2,2.2205218187822815E-2,2.3666125362403964E-2,2.5046341888414436E-2,2.6352364836478546E-2,2.7590012881244935E-2,2.8764512480765503E-2,2.9880571260761192E-2,3.0942440763758197E-2,3.1953970316698894E-2,3.2918653448177557E-2,3.3839668029124012E-2,3.4719911104278481E-2,3.5562029215259756E-2,3.6368444881030283E-2,3.714137979161522E-2,3.7882875180975439E-2,3.8594809771021373E-2,3.9278915617761055E-2,3.9936792140050262E-2,4.0569918569393383E-2,4.1179665024171433E-2,4.1767302382296506E-2,4.2334011101600059E-2,4.288088911644234E-2,4.3408958921417641E-2,{"$f":"SQRT(((AP80-AP81/2-Iout_PreReg)^2+AP81^2/12))","v":4.3919173938085899E-2},4.4412424247945739E-2,4.4889541764010527E-2,4.5351304904063763E-2,4.5798442820701814E-2,4.6231639236419757E-2,4.6651535926084474E-2,4.7058735884033434E-2,4.7453806208610047E-2,4.7837280733104788E-2,4.820966242872763E-2,4.8571425602320015E-2,4.8923017908968018E-2,4.9264862197446364E-2,4.9597358204466015E-2,4.9920884111978196E-2,5.0235797980272674E-2,5.0542439068272695E-2,5.0841129051248164E-2,0.14091201727316627]
["CIRCUIT PERFORMANCE",null,null,null,null,null,null,"Buck","Rds_On Buck",{"$f":"IF(J2>7,Buck_RdsON_factor_7V*(J67-150)+Rds_ON_150_7V,IF(J2<5,Buck_RdsON_factor_5V*(J67-150)+Rds_ON_150,Buck_RdsON_factor_6V*(J67-150)+Rds_ON_150_6V))","v":0.19189714648059564},{"$f":"IF(K65>7,Buck_RdsON_factor_7V*(K67-150)+Rds_ON_150_7V,IF(K65<5,Buck_RdsON_factor_5V*(K67-150)+Rds_ON_150,Buck_RdsON_factor_6V*(K67-150)+Rds_ON_150_6V))","v":0.20347830095972116},0.2035025495258044,0.20353069320781661,0.18994207298648863,0.18997967756570255,0.19002061103386614,0.19006475028614875,0.19011198642034097,0.19016222273570368,0.19021537306239222,0.19027136035921208,0.19033011553054835,0.19039157642337312,0.19045568697303131,0.19052239647259089,0.19059165894532684,0.19066343260368973,0.19073767938112238,0.19081436452549683,0.19089345624488543,0.19097492539794855,0.19105874522249996,0.19114489109685268,0.19123334032940634,0.19132407197264228,0.19141706665827771,0.19151230645081632,0.19160977471713861,0.19170945601011413,0.1918113359645042,0.19191540120366354,0.19202163925575372,{"$f":"IF(AQ65>7,Buck_RdsON_factor_7V*(AQ67-150)+Rds_ON_150_7V,IF(AQ65<5,Buck_RdsON_factor_5V*(AQ67-150)+Rds_ON_150,Buck_RdsON_factor_6V*(AQ67-150)+Rds_ON_150_6V))","v":0.19213003847835328},0.19224058799049754,0.1923532776113055,0.19246809780445989,0.19258503962789789,0.1927040946881497,0.19282525509883114,0.19294851344285494,0.19307386273797691,0.19320129640533867,0.19333080824070631,0.19346239238813892,0.19359604331585054,0.19373175579405488,0.19386952487460535,0.19400934587226232,0.19415121434743798,0.19429512609028438,0.19851462409051265,"Rds_On Buck","Buck"]
["A81407 Operating at Vin nom",null,null,null,null,null,null,null,"Conduction Losses",{"$f":"J83^2*J86","v":2.5837943771058029E-2},5.6103415557231091E-2,5.419928050152803E-2,5.2422638358659034E-2,4.7314768805533126E-2,4.5865741038157701E-2,4.4504748513036076E-2,4.3223994590892413E-2,4.2016582131797986E-2,4.0876386755610492E-2,3.9797951038833233E-2,3.8776395705811782E-2,3.780734470093728E-2,3.6886861665776587E-2,3.6011395838838278E-2,3.5177735781097681E-2,3.4382969633299565E-2,3.3624450850648822E-2,3.2899768551188965E-2,3.2206721766819373E-2,3.1543297008785443E-2,3.0907648658913978E-2,3.0298081778739567E-2,2.9713036994755034E-2,2.9151077172272059E-2,2.8610875635108137E-2,2.8091205725351388E-2,2.7590931528237925E-2,2.7108999612864473E-2,2.6644431660970577E-2,2.6196317874104685E-2,2.5763811064733872E-2,{"$f":"AP83^2*AP86","v":2.534612134975528E-2},2.4942511375813051E-2,2.455229201514229E-2,2.4174818478614246E-2,2.3809486799467757E-2,2.3455730647054664E-2,2.3113018434958027E-2,2.2780850692181193E-2,2.2458757669858921E-2,2.2146297159195222E-2,2.1843052499160021E-2,2.1548630754937934E-2,2.1262661050270661E-2,2.0984793038713402E-2,2.0714695500470903E-2,2.0452055052924266E-2,2.0196574964230243E-2,1.9947974060494745E-2,1.9705985718010806E-2,1.0630453972860512E-2,"Conduction Losses"]
["Pdiss Total",{"$f":"IF(Topology=\"Buck\",J66,J3)","v":0.95451733350131329},null,null,"A81407 Power dissipation at nominal input voltage",null,null,null,"Switching Losses",{"$f":"IF(J76=1,0,0.5*J65*Iout_PreReg*J74*10^3*(J65/SLEW_rate+J65/1.5)*10^-9)","v":0.20314800000000002},4.7094666666666667E-2,5.0556934610578919E-2,5.4141996945717058E-2,5.7849853672081057E-2,6.1680504789670965E-2,6.5633950298486732E-2,6.9710190198528366E-2,7.3909224489795894E-2,7.8231053172289317E-2,8.2675676246008578E-2,8.7243093710953762E-2,9.1933305567124785E-2,9.6746311814521688E-2,0.1016821124531445,0.10674070748299318,0.11192209690406772,0.11722628071636816,0.12265325891989447,0.12820303151464663,0.13387559850062472,0.13967095987782865,0.14558911564625843,0.15163006580591415,0.15779381035679574,0.16408034929890317,0.17048968263223652,0.17702181035679573,0.18367673247258079,0.19045444897959174,0.19735495987782861,0.20437826516729135,{"$f":"IF(AP76=1,0,0.5*AP65*Iout_PreReg*AP74*10^3*(AP65/SLEW_rate+AP65/1.5)*10^-9)","v":0.21152436484797987},0.21879325891989435,0.22618494738303485,0.23369943023740097,0.24133670748299305,0.24909677911981107,0.25697964514785498,0.26498530556712468,0.27311376037762031,0.28136500957934185,0.28973905317228915,0.29823589115646248,0.30685552353186157,0.31559795029848653,0.32446317145633752,0.33345118700541432,0.34256199694571682,0.35179560127724535,0.36115199999999986,0.63746240509294039,"Switching Losses"]
["Tj estimate",{"$f":"IF(Reset=1,150,Ta+Rth_ja*Pdiss_total)","v":153.63552000503941},null,null,"Estimated A81407 junction temperature at nominal input voltage",null,null,null,"Total Buck FET Losses",{"$f":"J87+J88","v":0.22898594377105805},0.10319808222389776,0.10475621511210695,0.1065646353043761,0.10516462247761418,0.10754624582782867,0.1101386988115228,0.11293418478942077,0.11592580662159388,0.11910743992789981,0.12247362728484182,0.12601948941676555,0.12974065026806206,0.13363317348029827,0.13769350829198279,0.14191844326409087,0.1463050665373673,0.15085073156701698,0.15555302747108343,0.16040975328146601,0.16541889550941016,0.17057860853674264,0.175887197424998,0.18134310280066918,0.18694488752906779,0.19269122493401131,0.19858088835758791,0.20461274188503364,0.21078573208544527,0.21709888064056232,0.22355127775193329,0.23014207623202523,{"$f":"AP87+AP88","v":0.23687048619773515},0.24373577029570739,0.25073723939817716,0.25787424871601522,0.26514619428246078,0.27255250976686574,0.28009266358281304,0.28776615625930591,0.29557251804747925,0.3035113067385371,0.31158210567144917,0.31978452191140044,0.32811818458213221,0.33658274333719995,0.34517786695680841,0.35390324205833856,0.36275857190994704,0.37174357533774011,0.38085798571801066,0.64809285906580094,"Total Buck FET Losses"]
["T rise",{"$f":"Tj-Ta","v":28.63552000503941},null,null,"A81407 temperature rise at nominal input voltage",null,null,"VUC LDO","Output voltage",{"$f":"IF(J77-3.3<J91*Iout_VUC,J77-J91*Iout_VUC,VUC)","v":3.3},3.3,3.3,3.3,3.3,3.3,3.3,3.3,3.3,3.3,3.3,3.3,3.3,3.3,3.3,3.3,3.3,3.3,3.3,3.3,3.3,3.3,3.3,3.3,3.3,3.3,3.3,3.3,3.3,3.3,3.3,3.3,{"$f":"IF(AP77-3.3<AP91*Iout_VUC,AP77-AP91*Iout_VUC,VUC)","v":3.3},3.3,3.3,3.3,3.3,3.3,3.3,3.3,3.3,3.3,3.3,3.3,3.3,3.3,3.3,3.3,3.3,3.3,3.3,3.3,"Output voltage","5V0 LDO"]
[null,null,null,null,null,null,null,null,"Series pass resistance",{"$f":"(Rds_ON_VUC_150-Rds_ON_VUC_min40)/190*(J67-150)+Rds_ON_VUC_150","v":0.50633328636640651},0.50284366627053767,0.50288689215713644,0.50293706154047035,0.50289822223726055,0.50296429348293936,0.50303621358650286,0.50311376625276338,0.50319676014053905,0.50328502534663133,0.50337841047062315,0.50347678015113562,0.50358001298717348,0.50368799977586654,0.50380064201161601,0.50391785060234218,0.50403954476693924,0.50416565108468281,0.50429610267263203,0.50443083847129788,0.5045698026222637,0.50471294392419563,0.5048602153559324,0.50501157365717009,0.50516697895876694,0.50532639445593253,0.50548978611859396,0.50565712243408434,0.50582837417801252,0.50600351420977052,0.50618251728963393,0.50636535991483689,{"$f":"(Rds_ON_VUC_150-Rds_ON_VUC_min40)/190*(AP67-150)+Rds_ON_VUC_150","v":0.50655202017235923},0.50674247760646673,0.50693671309930421,0.50713470876306377,0.50733644784243603,0.50754191462621656,0.50775109436707899,0.50796397320864628,0.50818053811909614,0.50840077683062546,0.50862467778418008,0.508852230078921,0.50908342342596014,0.50931824810594939,0.50955669493015443,0.50979875520468154,0.51004442069756484,0.51029368360844851,0.51054653654062965,0.51796019452703079,"Series pass resistance"]
["Tj (MAX):",{"$f":"IF(Topology=\"Buck\",MAX(K67:BH67),MAX(K4:BH4))","v":157.76963518297364},{"$f":"IF(Topology=\"Buck\",HLOOKUP(B92,K67:BI68,2,FALSE),HLOOKUP(B92,K4:BI5,2,FALSE))","v":3.5},null,"Maximum junction temperature at worse case operating voltage",null,null,null,"Dropout",{"$f":"J77-J90","v":2.0499999999999998},2.0499999999999998,2.0499999999999998,2.0499999999999998,2.0499999999999989,2.0499999999999998,2.0499999999999998,2.0499999999999998,2.0499999999999998,2.0499999999999989,2.0499999999999989,2.0499999999999989,2.0500000000000007,2.0499999999999989,2.0500000000000016,2.0499999999999998,2.0499999999999989,2.0499999999999989,2.0500000000000007,2.0499999999999989,2.0500000000000007,2.0499999999999989,2.0499999999999998,2.0499999999999998,2.0500000000000007,2.0499999999999989,2.0500000000000007,2.0500000000000007,2.0500000000000007,2.0499999999999998,2.0499999999999998,2.0499999999999989,{"$f":"AP77-AP90","v":2.0499999999999998},2.0499999999999989,2.0499999999999998,2.0499999999999989,2.0499999999999998,2.0499999999999998,2.0499999999999998,2.0499999999999989,2.0499999999999989,2.0500000000000007,2.0499999999999998,2.0499999999999998,2.0499999999999998,2.0499999999999998,2.0500000000000016,2.0499999999999989,2.0499999999999998,2.049999999999998,2.0500000000000007,2.0500000000000007,"Dropout"]
[null,null,null,null,null,null,null,null,"Power dissipated",{"$f":"(J77-J90)*Iout_VUC","v":0.51249999999999996},0.51249999999999996,0.51249999999999996,0.51249999999999996,0.51249999999999973,0.51249999999999996,0.51249999999999996,0.51249999999999996,0.51249999999999996,0.51249999999999973,0.51249999999999973,0.51249999999999973,0.51250000000000018,0.51249999999999973,0.5125000000000004,0.51249999999999996,0.51249999999999973,0.51249999999999973,0.51250000000000018,0.51249999999999973,0.51250000000000018,0.51249999999999973,0.51249999999999996,0.51249999999999996,0.51250000000000018,0.51249999999999973,0.51250000000000018,0.51250000000000018,0.51250000000000018,0.51249999999999996,0.51249999999999996,0.51249999999999973,{"$f":"(AP77-AP90)*Iout_VUC","v":0.51249999999999996},0.51249999999999973,0.51249999999999996,0.51249999999999973,0.51249999999999996,0.51249999999999996,0.51249999999999996,0.51249999999999973,0.51249999999999973,0.51250000000000018,0.51249999999999996,0.51249999999999996,0.51249999999999996,0.51249999999999996,0.5125000000000004,0.51249999999999973,0.51249999999999996,0.51249999999999951,0.51250000000000018,0.51250000000000018,"Power dissipated"]
[null,null,null,null,null,null,null,"V5A LDO","Output voltage",{"$f":"IF(J77-5<J95*Iout_V5C,J77-J95*Iout_V5C,5)","v":5},5,5,5,5,5,5,5,5,5,5,5,5,5,5,5,5,5,5,5,5,5,5,5,5,5,5,5,5,5,5,5,{"$f":"IF(AP77-5<AP95*Iout_V5C,AP77-AP95*Iout_V5C,5)","v":5},5,5,5,5,5,5,5,5,5,5,5,5,5,5,5,5,5,5,5]
[null,null,null,null,null,null,null,null,"Series pass resistance",{"$f":"(Rds_ON_V5A_150-Rds_ON_V5A_min40)/190*(J67-150)+Rds_ON_V5A_150","v":0.70770410805297279},0.6985917705459459,0.6987046449726475,0.6988356507385759,0.69873423086200981,0.69890676067144331,0.69909456342337783,0.69929707431285038,0.69951379369652422,0.69974427791140836,0.69998813161025553,0.700245001328065,0.70051457005415574,0.70079655263043583,0.70109069183226758,0.70139675501624699,0.70171453124115957,0.70204382878572846,0.70238447300058937,0.70273630444297941,0.70309917725153426,0.703472957725788,0.70385752308082983,0.70425276035235995,0.70465856543131622,0.70507484221048267,0.70550150182817806,0.70593846199634525,0.70638564640223189,0.70684298417440361,0.70731040940514522,0.70778786072240829,{"$f":"(Rds_ON_V5A_150-Rds_ON_V5A_min40)/190*(AP67-150)+Rds_ON_V5A_150","v":0.70827528090539793},0.70877261653868473,0.7092798177004026,0.70979683768066959,0.71032363272686194,0.71086016181279543,0.71140638642923071,0.71196227039343718,0.71252777967581837,0.71310288224183793,0.71368754790769373,0.71428174820836055,0.71488545627678135,0.71549864673312213,0.71612129558312376,0.71675338012468925,0.71739487886193942,0.71804577142604542,0.7187060385022247,0.73806509532727205]
[null,null,null,null,null,null,null,null,"Dropout",{"$f":"J77-J94","v":0.34999999999999964},0.34999999999999964,0.34999999999999964,0.34999999999999964,0.34999999999999876,0.34999999999999964,0.34999999999999964,0.34999999999999964,0.34999999999999964,0.34999999999999876,0.34999999999999876,0.34999999999999876,0.35000000000000053,0.34999999999999876,0.35000000000000142,0.34999999999999964,0.34999999999999876,0.34999999999999876,0.35000000000000053,0.34999999999999876,0.35000000000000053,0.34999999999999876,0.34999999999999964,0.34999999999999964,0.35000000000000053,0.34999999999999876,0.35000000000000053,0.35000000000000053,0.35000000000000053,0.34999999999999964,0.34999999999999964,0.34999999999999876,{"$f":"AP77-AP94","v":0.34999999999999964},0.34999999999999876,0.34999999999999964,0.34999999999999876,0.34999999999999964,0.34999999999999964,0.34999999999999964,0.34999999999999876,0.34999999999999876,0.35000000000000053,0.34999999999999964,0.34999999999999964,0.34999999999999964,0.34999999999999964,0.35000000000000142,0.34999999999999876,0.34999999999999964,0.34999999999999787,0.35000000000000053,0.35000000000000053]
[null,null,null,null,null,null,null,null,"Power dissipated",{"$f":"(J77-J94)*Iout_V5C","v":3.4999999999999969E-2},3.4999999999999969E-2,3.4999999999999969E-2,3.4999999999999969E-2,3.4999999999999878E-2,3.4999999999999969E-2,3.4999999999999969E-2,3.4999999999999969E-2,3.4999999999999969E-2,3.4999999999999878E-2,3.4999999999999878E-2,3.4999999999999878E-2,3.5000000000000052E-2,3.4999999999999878E-2,3.5000000000000142E-2,3.4999999999999969E-2,3.4999999999999878E-2,3.4999999999999878E-2,3.5000000000000052E-2,3.4999999999999878E-2,3.5000000000000052E-2,3.4999999999999878E-2,3.4999999999999969E-2,3.4999999999999969E-2,3.5000000000000052E-2,3.4999999999999878E-2,3.5000000000000052E-2,3.5000000000000052E-2,3.5000000000000052E-2,3.4999999999999969E-2,3.4999999999999969E-2,3.4999999999999878E-2,{"$f":"(AP77-AP94)*Iout_V5C","v":3.4999999999999969E-2},3.4999999999999878E-2,3.4999999999999969E-2,3.4999999999999878E-2,3.4999999999999969E-2,3.4999999999999969E-2,3.4999999999999969E-2,3.4999999999999878E-2,3.4999999999999878E-2,3.5000000000000052E-2,3.4999999999999969E-2,3.4999999999999969E-2,3.4999999999999969E-2,3.4999999999999969E-2,3.5000000000000142E-2,3.4999999999999878E-2,3.4999999999999969E-2,3.4999999999999788E-2,3.5000000000000052E-2,3.5000000000000052E-2]
[null,null,null,null,null,null,null,"V5P1 LDO","Output voltage",{"$f":"IF(J77-5<J99*Iout_V5P1,J77-J99*Iout_V5P1,5)","v":5},5,5,5,5,5,5,5,5,5,5,5,5,5,5,5,5,5,5,5,5,5,5,5,5,5,5,5,5,5,5,5,{"$f":"IF(AP77-5<AP99*Iout_V5P1,AP77-AP99*Iout_V5P1,5)","v":5},5,5,5,5,5,5,5,5,5,5,5,5,5,5,5,5,5,5,5]
[null,null,null,null,null,null,null,null,"Series pass resistance",{"$f":"(Rds_ON_V5P1_150-Rds_ON_V5P1_min40)/190*(J67-150)+Rds_ON_V5P1_150","v":0.70770410805297279},0.6985917705459459,0.6987046449726475,0.6988356507385759,0.69873423086200981,0.69890676067144331,0.69909456342337783,0.69929707431285038,0.69951379369652422,0.69974427791140836,0.69998813161025553,0.700245001328065,0.70051457005415574,0.70079655263043583,0.70109069183226758,0.70139675501624699,0.70171453124115957,0.70204382878572846,0.70238447300058937,0.70273630444297941,0.70309917725153426,0.703472957725788,0.70385752308082983,0.70425276035235995,0.70465856543131622,0.70507484221048267,0.70550150182817806,0.70593846199634525,0.70638564640223189,0.70684298417440361,0.70731040940514522,0.70778786072240829,{"$f":"(Rds_ON_V5P1_150-Rds_ON_V5P1_min40)/190*(AP67-150)+Rds_ON_V5P1_150","v":0.70827528090539793},0.70877261653868473,0.7092798177004026,0.70979683768066959,0.71032363272686194,0.71086016181279543,0.71140638642923071,0.71196227039343718,0.71252777967581837,0.71310288224183793,0.71368754790769373,0.71428174820836055,0.71488545627678135,0.71549864673312213,0.71612129558312376,0.71675338012468925,0.71739487886193942,0.71804577142604542,0.7187060385022247,0.73806509532727205]
[null,null,null,null,null,null,null,null,"Dropout",{"$f":"J77-J98","v":0.34999999999999964},0.34999999999999964,0.34999999999999964,0.34999999999999964,0.34999999999999876,0.34999999999999964,0.34999999999999964,0.34999999999999964,0.34999999999999964,0.34999999999999876,0.34999999999999876,0.34999999999999876,0.35000000000000053,0.34999999999999876,0.35000000000000142,0.34999999999999964,0.34999999999999876,0.34999999999999876,0.35000000000000053,0.34999999999999876,0.35000000000000053,0.34999999999999876,0.34999999999999964,0.34999999999999964,0.35000000000000053,0.34999999999999876,0.35000000000000053,0.35000000000000053,0.35000000000000053,0.34999999999999964,0.34999999999999964,0.34999999999999876,{"$f":"AP77-AP98","v":0.34999999999999964},0.34999999999999876,0.34999999999999964,0.34999999999999876,0.34999999999999964,0.34999999999999964,0.34999999999999964,0.34999999999999876,0.34999999999999876,0.35000000000000053,0.34999999999999964,0.34999999999999964,0.34999999999999964,0.34999999999999964,0.35000000000000142,0.34999999999999876,0.34999999999999964,0.34999999999999787,0.35000000000000053,0.35000000000000053]
[null,null,null,null,null,null,null,null,"Power dissipated",{"$f":"(J77-J98)*Iout_V5P1","v":3.4999999999999969E-2},3.4999999999999969E-2,3.4999999999999969E-2,3.4999999999999969E-2,3.4999999999999878E-2,3.4999999999999969E-2,3.4999999999999969E-2,3.4999999999999969E-2,3.4999999999999969E-2,3.4999999999999878E-2,3.4999999999999878E-2,3.4999999999999878E-2,3.5000000000000052E-2,3.4999999999999878E-2,3.5000000000000142E-2,3.4999999999999969E-2,3.4999999999999878E-2,3.4999999999999878E-2,3.5000000000000052E-2,3.4999999999999878E-2,3.5000000000000052E-2,3.4999999999999878E-2,3.4999999999999969E-2,3.4999999999999969E-2,3.5000000000000052E-2,3.4999999999999878E-2,3.5000000000000052E-2,3.5000000000000052E-2,3.5000000000000052E-2,3.4999999999999969E-2,3.4999999999999969E-2,3.4999999999999878E-2,{"$f":"(AP77-AP98)*Iout_V5P1","v":3.4999999999999969E-2},3.4999999999999878E-2,3.4999999999999969E-2,3.4999999999999878E-2,3.4999999999999969E-2,3.4999999999999969E-2,3.4999999999999969E-2,3.4999999999999878E-2,3.4999999999999878E-2,3.5000000000000052E-2,3.4999999999999969E-2,3.4999999999999969E-2,3.4999999999999969E-2,3.4999999999999969E-2,3.5000000000000142E-2,3.4999999999999878E-2,3.4999999999999969E-2,3.4999999999999788E-2,3.5000000000000052E-2,3.5000000000000052E-2]
[null,null,null,null,null,null,null,"V5P2 LDO","Output voltage",{"$f":"IF(J77-5<J103*Iout_V5P2,J77-J103*Iout_V5P2,5)","v":5},5,5,5,5,5,5,5,5,5,5,5,5,5,5,5,5,5,5,5,5,5,5,5,5,5,5,5,5,5,5,5,{"$f":"IF(AP77-5<AP103*Iout_V5P2,AP77-AP103*Iout_V5P2,5)","v":5},5,5,5,5,5,5,5,5,5,5,5,5,5,5,5,5,5,5,5]
[null,null,null,null,null,null,null,null,"Series pass resistance",{"$f":"(Rds_ON_V5P2_150-Rds_ON_V5P2_min40)/190*(J67-150)+Rds_ON_V5P2_150","v":0.70770410805297279},0.6985917705459459,0.6987046449726475,0.6988356507385759,0.69873423086200981,0.69890676067144331,0.69909456342337783,0.69929707431285038,0.69951379369652422,0.69974427791140836,0.69998813161025553,0.700245001328065,0.70051457005415574,0.70079655263043583,0.70109069183226758,0.70139675501624699,0.70171453124115957,0.70204382878572846,0.70238447300058937,0.70273630444297941,0.70309917725153426,0.703472957725788,0.70385752308082983,0.70425276035235995,0.70465856543131622,0.70507484221048267,0.70550150182817806,0.70593846199634525,0.70638564640223189,0.70684298417440361,0.70731040940514522,0.70778786072240829,{"$f":"(Rds_ON_V5P2_150-Rds_ON_V5P2_min40)/190*(AP67-150)+Rds_ON_V5P2_150","v":0.70827528090539793},0.70877261653868473,0.7092798177004026,0.70979683768066959,0.71032363272686194,0.71086016181279543,0.71140638642923071,0.71196227039343718,0.71252777967581837,0.71310288224183793,0.71368754790769373,0.71428174820836055,0.71488545627678135,0.71549864673312213,0.71612129558312376,0.71675338012468925,0.71739487886193942,0.71804577142604542,0.7187060385022247,0.73806509532727205]
[null,null,null,null,null,null,null,null,"Dropout",{"$f":"J77-J102","v":0.34999999999999964},0.34999999999999964,0.34999999999999964,0.34999999999999964,0.34999999999999876,0.34999999999999964,0.34999999999999964,0.34999999999999964,0.34999999999999964,0.34999999999999876,0.34999999999999876,0.34999999999999876,0.35000000000000053,0.34999999999999876,0.35000000000000142,0.34999999999999964,0.34999999999999876,0.34999999999999876,0.35000000000000053,0.34999999999999876,0.35000000000000053,0.34999999999999876,0.34999999999999964,0.34999999999999964,0.35000000000000053,0.34999999999999876,0.35000000000000053,0.35000000000000053,0.35000000000000053,0.34999999999999964,0.34999999999999964,0.34999999999999876,{"$f":"AP77-AP102","v":0.34999999999999964},0.34999999999999876,0.34999999999999964,0.34999999999999876,0.34999999999999964,0.34999999999999964,0.34999999999999964,0.34999999999999876,0.34999999999999876,0.35000000000000053,0.34999999999999964,0.34999999999999964,0.34999999999999964,0.34999999999999964,0.35000000000000142,0.34999999999999876,0.34999999999999964,0.34999999999999787,0.35000000000000053,0.35000000000000053]
[null,null,null,null,null,null,null,null,"Power dissipated",{"$f":"(J77-J102)*Iout_V5P2","v":3.4999999999999969E-2},3.4999999999999969E-2,3.4999999999999969E-2,3.4999999999999969E-2,3.4999999999999878E-2,3.4999999999999969E-2,3.4999999999999969E-2,3.4999999999999969E-2,3.4999999999999969E-2,3.4999999999999878E-2,3.4999999999999878E-2,3.4999999999999878E-2,3.5000000000000052E-2,3.4999999999999878E-2,3.5000000000000142E-2,3.4999999999999969E-2,3.4999999999999878E-2,3.4999999999999878E-2,3.5000000000000052E-2,3.4999999999999878E-2,3.5000000000000052E-2,3.4999999999999878E-2,3.4999999999999969E-2,3.4999999999999969E-2,3.5000000000000052E-2,3.4999999999999878E-2,3.5000000000000052E-2,3.5000000000000052E-2,3.5000000000000052E-2,3.4999999999999969E-2,3.4999999999999969E-2,3.4999999999999878E-2,{"$f":"(AP77-AP102)*Iout_V5P2","v":3.4999999999999969E-2},3.4999999999999878E-2,3.4999999999999969E-2,3.4999999999999878E-2,3.4999999999999969E-2,3.4999999999999969E-2,3.4999999999999969E-2,3.4999999999999878E-2,3.4999999999999878E-2,3.5000000000000052E-2,3.4999999999999969E-2,3.4999999999999969E-2,3.4999999999999969E-2,3.4999999999999969E-2,3.5000000000000142E-2,3.4999999999999878E-2,3.4999999999999969E-2,3.4999999999999788E-2,3.5000000000000052E-2,3.5000000000000052E-2]
[null,null,null,null,null,null,null,"Buck Diode","Tj Diode",{"$f":"J109*RTHavg_Vd+Ta","v":134.50493455549162},127.53895906632884,128.01760963991958,128.46263330138515,128.8906895320805,129.27740664416046,129.639557953001,129.97940873666187,130.29895444953107,130.59995968193337,130.8839905672645,131.15244188576384,131.40655984942589,131.64746134930598,131.87615028919654,132.09353150708293,132.30042268963146,132.49756460904587,132.6856299513326,132.8652309568497,133.0369260553301,133.20122564633834,133.35859715078121,133.50946943843709,133.65423671955443,133.79326197465937,133.92687998522516,134.05540001833191,134.17910821051805,134.29826968940375,134.41313046611666,134.52391912688094,{"$f":"AP109*RTHavg_Vd+Ta","v":134.6308483481927},134.73411625666856,134.83390765182494,134.9303951076331,135.02373996663732,135.11409323866087,135.20159641461063,135.28638220458936,135.36857520840087,135.44829252556124,135.52564431108706,135.60073428259994,135.67366018364908,135.74451420759777,135.81338338593463,135.88034994444277,135.94549163028844,136.00888201276112,136.07059076010759,138.38585976343504,"Tj Diode"]
[null,null,null,null,null,null,null,null,"I Buck Diode ON",{"$f":"J80-J81/2","v":0.56999999999999995},0.56999999999999995,0.56999999999999995,0.56999999999999995,0.56999999999999995,0.56999999999999995,0.56999999999999995,0.56999999999999995,0.56999999999999995,0.56999999999999995,0.56999999999999995,0.56999999999999995,0.56999999999999995,0.56999999999999995,0.56999999999999995,0.56999999999999995,0.56999999999999995,0.56999999999999995,0.56999999999999995,0.56999999999999995,0.56999999999999995,0.56999999999999995,0.56999999999999995,0.56999999999999995,0.56999999999999995,0.57000000000000006,0.56999999999999995,0.56999999999999995,0.56999999999999995,0.56999999999999995,0.56999999999999995,0.56999999999999995,{"$f":"AP80-AP81/2","v":0.56999999999999995},0.56999999999999984,0.56999999999999995,0.56999999999999995,0.56999999999999995,0.56999999999999995,0.56999999999999995,0.56999999999999995,0.56999999999999995,0.56999999999999995,0.56999999999999995,0.56999999999999995,0.56999999999999995,0.56999999999999995,0.56999999999999995,0.56999999999999995,0.56999999999999995,0.56999999999999995,0.56999999999999995,0.56999999999999995,"I Buck Diode ON"]
[null,null,null,null,null,null,null,null,"Vf buck diode",{"$f":"IF(J107<I_Vd1,Vd_1+(J106-25)*vd_temp_coeff/1000,IF(J107=0,0,IF(Reset=1,0.45,FORECAST(J107, OFFSET(Vd_1:Vd_3,MATCH(J107,I_Vd1:I_Vd3,1)-1,0,2), OFFSET(I_Vd1:I_Vd3,MATCH(J107,I_Vd1:I_Vd3,1)-1,0,2))+(J106-25)*vd_temp_coeff/1000)))","v":0.23634407853341008},{"$f":"IF(K107<I_Vd1,Vd_1+(K106-25)*vd_temp_coeff/1000,IF(K107=0,0,IF(Reset=1,0.45,FORECAST(K107, OFFSET(Vd_1:Vd_3,MATCH(K107,I_Vd1:I_Vd3,1)-1,0,2), OFFSET(I_Vd1:I_Vd3,MATCH(K107,I_Vd1:I_Vd3,1)-1,0,2))+(K106-25)*vd_temp_coeff/1000)))","v":0.24470324912040542},{"$f":"IF(L107<I_Vd1,Vd_1+(L106-25)*vd_temp_coeff/1000,IF(L107=0,0,IF(Reset=1,0.45,FORECAST(L107, OFFSET(Vd_1:Vd_3,MATCH(L107,I_Vd1:I_Vd3,1)-1,0,2), OFFSET(I_Vd1:I_Vd3,MATCH(L107,I_Vd1:I_Vd3,1)-1,0,2))+(L106-25)*vd_temp_coeff/1000)))","v":0.24412886843209652},{"$f":"IF(M107<I_Vd1,Vd_1+(M106-25)*vd_temp_coeff/1000,IF(M107=0,0,IF(Reset=1,0.45,FORECAST(M107, OFFSET(Vd_1:Vd_3,MATCH(M107,I_Vd1:I_Vd3,1)-1,0,2), OFFSET(I_Vd1:I_Vd3,MATCH(M107,I_Vd1:I_Vd3,1)-1,0,2))+(M106-25)*vd_temp_coeff/1000)))","v":0.24359484003833784},{"$f":"IF(N107<I_Vd1,Vd_1+(N106-25)*vd_temp_coeff/1000,IF(N107=0,0,IF(Reset=1,0.45,FORECAST(N107, OFFSET(Vd_1:Vd_3,MATCH(N107,I_Vd1:I_Vd3,1)-1,0,2), OFFSET(I_Vd1:I_Vd3,MATCH(N107,I_Vd1:I_Vd3,1)-1,0,2))+(N106-25)*vd_temp_coeff/1000)))","v":0.24308117256150341},{"$f":"IF(O107<I_Vd1,Vd_1+(O106-25)*vd_temp_coeff/1000,IF(O107=0,0,IF(Reset=1,0.45,FORECAST(O107, OFFSET(Vd_1:Vd_3,MATCH(O107,I_Vd1:I_Vd3,1)-1,0,2), OFFSET(I_Vd1:I_Vd3,MATCH(O107,I_Vd1:I_Vd3,1)-1,0,2))+(O106-25)*vd_temp_coeff/1000)))","v":0.24261711202700748},{"$f":"IF(P107<I_Vd1,Vd_1+(P106-25)*vd_temp_coeff/1000,IF(P107=0,0,IF(Reset=1,0.45,FORECAST(P107, OFFSET(Vd_1:Vd_3,MATCH(P107,I_Vd1:I_Vd3,1)-1,0,2), OFFSET(I_Vd1:I_Vd3,MATCH(P107,I_Vd1:I_Vd3,1)-1,0,2))+(P106-25)*vd_temp_coeff/1000)))","v":0.24218253045639884},{"$f":"IF(Q107<I_Vd1,Vd_1+(Q106-25)*vd_temp_coeff/1000,IF(Q107=0,0,IF(Reset=1,0.45,FORECAST(Q107, OFFSET(Vd_1:Vd_3,MATCH(Q107,I_Vd1:I_Vd3,1)-1,0,2), OFFSET(I_Vd1:I_Vd3,MATCH(Q107,I_Vd1:I_Vd3,1)-1,0,2))+(Q106-25)*vd_temp_coeff/1000)))","v":0.2417747095160058},{"$f":"IF(R107<I_Vd1,Vd_1+(R106-25)*vd_temp_coeff/1000,IF(R107=0,0,IF(Reset=1,0.45,FORECAST(R107, OFFSET(Vd_1:Vd_3,MATCH(R107,I_Vd1:I_Vd3,1)-1,0,2), OFFSET(I_Vd1:I_Vd3,MATCH(R107,I_Vd1:I_Vd3,1)-1,0,2))+(R106-25)*vd_temp_coeff/1000)))","v":0.24139125466056274},{"$f":"IF(S107<I_Vd1,Vd_1+(S106-25)*vd_temp_coeff/1000,IF(S107=0,0,IF(Reset=1,0.45,FORECAST(S107, OFFSET(Vd_1:Vd_3,MATCH(S107,I_Vd1:I_Vd3,1)-1,0,2), OFFSET(I_Vd1:I_Vd3,MATCH(S107,I_Vd1:I_Vd3,1)-1,0,2))+(S106-25)*vd_temp_coeff/1000)))","v":0.24103004838167999},{"$f":"IF(T107<I_Vd1,Vd_1+(T106-25)*vd_temp_coeff/1000,IF(T107=0,0,IF(Reset=1,0.45,FORECAST(T107, OFFSET(Vd_1:Vd_3,MATCH(T107,I_Vd1:I_Vd3,1)-1,0,2), OFFSET(I_Vd1:I_Vd3,MATCH(T107,I_Vd1:I_Vd3,1)-1,0,2))+(T106-25)*vd_temp_coeff/1000)))","v":0.24068921131928261},{"$f":"IF(U107<I_Vd1,Vd_1+(U106-25)*vd_temp_coeff/1000,IF(U107=0,0,IF(Reset=1,0.45,FORECAST(U107, OFFSET(Vd_1:Vd_3,MATCH(U107,I_Vd1:I_Vd3,1)-1,0,2), OFFSET(I_Vd1:I_Vd3,MATCH(U107,I_Vd1:I_Vd3,1)-1,0,2))+(U106-25)*vd_temp_coeff/1000)))","v":0.24036706973708341},{"$f":"IF(V107<I_Vd1,Vd_1+(V106-25)*vd_temp_coeff/1000,IF(V107=0,0,IF(Reset=1,0.45,FORECAST(V107, OFFSET(Vd_1:Vd_3,MATCH(V107,I_Vd1:I_Vd3,1)-1,0,2), OFFSET(I_Vd1:I_Vd3,MATCH(V107,I_Vd1:I_Vd3,1)-1,0,2))+(V106-25)*vd_temp_coeff/1000)))","v":0.24006212818068898},{"$f":"IF(W107<I_Vd1,Vd_1+(W106-25)*vd_temp_coeff/1000,IF(W107=0,0,IF(Reset=1,0.45,FORECAST(W107, OFFSET(Vd_1:Vd_3,MATCH(W107,I_Vd1:I_Vd3,1)-1,0,2), OFFSET(I_Vd1:I_Vd3,MATCH(W107,I_Vd1:I_Vd3,1)-1,0,2))+(W106-25)*vd_temp_coeff/1000)))","v":0.23977304638083285},{"$f":"IF(X107<I_Vd1,Vd_1+(X106-25)*vd_temp_coeff/1000,IF(X107=0,0,IF(Reset=1,0.45,FORECAST(X107, OFFSET(Vd_1:Vd_3,MATCH(X107,I_Vd1:I_Vd3,1)-1,0,2), OFFSET(I_Vd1:I_Vd3,MATCH(X107,I_Vd1:I_Vd3,1)-1,0,2))+(X106-25)*vd_temp_coeff/1000)))","v":0.23949861965296418},{"$f":"IF(Y107<I_Vd1,Vd_1+(Y106-25)*vd_temp_coeff/1000,IF(Y107=0,0,IF(Reset=1,0.45,FORECAST(Y107, OFFSET(Vd_1:Vd_3,MATCH(Y107,I_Vd1:I_Vd3,1)-1,0,2), OFFSET(I_Vd1:I_Vd3,MATCH(Y107,I_Vd1:I_Vd3,1)-1,0,2))+(Y106-25)*vd_temp_coeff/1000)))","v":0.2392377621915005},{"$f":"IF(Z107<I_Vd1,Vd_1+(Z106-25)*vd_temp_coeff/1000,IF(Z107=0,0,IF(Reset=1,0.45,FORECAST(Z107, OFFSET(Vd_1:Vd_3,MATCH(Z107,I_Vd1:I_Vd3,1)-1,0,2), OFFSET(I_Vd1:I_Vd3,MATCH(Z107,I_Vd1:I_Vd3,1)-1,0,2))+(Z106-25)*vd_temp_coeff/1000)))","v":0.23898949277244227},{"$f":"IF(AA107<I_Vd1,Vd_1+(AA106-25)*vd_temp_coeff/1000,IF(AA107=0,0,IF(Reset=1,0.45,FORECAST(AA107, OFFSET(Vd_1:Vd_3,MATCH(AA107,I_Vd1:I_Vd3,1)-1,0,2), OFFSET(I_Vd1:I_Vd3,MATCH(AA107,I_Vd1:I_Vd3,1)-1,0,2))+(AA106-25)*vd_temp_coeff/1000)))","v":0.23875292246914501},{"$f":"IF(AB107<I_Vd1,Vd_1+(AB106-25)*vd_temp_coeff/1000,IF(AB107=0,0,IF(Reset=1,0.45,FORECAST(AB107, OFFSET(Vd_1:Vd_3,MATCH(AB107,I_Vd1:I_Vd3,1)-1,0,2), OFFSET(I_Vd1:I_Vd3,MATCH(AB107,I_Vd1:I_Vd3,1)-1,0,2))+(AB106-25)*vd_temp_coeff/1000)))","v":0.23852724405840092},{"$f":"IF(AC107<I_Vd1,Vd_1+(AC106-25)*vd_temp_coeff/1000,IF(AC107=0,0,IF(Reset=1,0.45,FORECAST(AC107, OFFSET(Vd_1:Vd_3,MATCH(AC107,I_Vd1:I_Vd3,1)-1,0,2), OFFSET(I_Vd1:I_Vd3,MATCH(AC107,I_Vd1:I_Vd3,1)-1,0,2))+(AC106-25)*vd_temp_coeff/1000)))","v":0.23831172285178037},{"$f":"IF(AD107<I_Vd1,Vd_1+(AD106-25)*vd_temp_coeff/1000,IF(AD107=0,0,IF(Reset=1,0.45,FORECAST(AD107, OFFSET(Vd_1:Vd_3,MATCH(AD107,I_Vd1:I_Vd3,1)-1,0,2), OFFSET(I_Vd1:I_Vd3,MATCH(AD107,I_Vd1:I_Vd3,1)-1,0,2))+(AD106-25)*vd_temp_coeff/1000)))","v":0.23810568873360391},{"$f":"IF(AE107<I_Vd1,Vd_1+(AE106-25)*vd_temp_coeff/1000,IF(AE107=0,0,IF(Reset=1,0.45,FORECAST(AE107, OFFSET(Vd_1:Vd_3,MATCH(AE107,I_Vd1:I_Vd3,1)-1,0,2), OFFSET(I_Vd1:I_Vd3,MATCH(AE107,I_Vd1:I_Vd3,1)-1,0,2))+(AE106-25)*vd_temp_coeff/1000)))","v":0.23790852922439401},{"$f":"IF(AF107<I_Vd1,Vd_1+(AF106-25)*vd_temp_coeff/1000,IF(AF107=0,0,IF(Reset=1,0.45,FORECAST(AF107, OFFSET(Vd_1:Vd_3,MATCH(AF107,I_Vd1:I_Vd3,1)-1,0,2), OFFSET(I_Vd1:I_Vd3,MATCH(AF107,I_Vd1:I_Vd3,1)-1,0,2))+(AF106-25)*vd_temp_coeff/1000)))","v":0.23771968341906258},{"$f":"IF(AG107<I_Vd1,Vd_1+(AG106-25)*vd_temp_coeff/1000,IF(AG107=0,0,IF(Reset=1,0.45,FORECAST(AG107, OFFSET(Vd_1:Vd_3,MATCH(AG107,I_Vd1:I_Vd3,1)-1,0,2), OFFSET(I_Vd1:I_Vd3,MATCH(AG107,I_Vd1:I_Vd3,1)-1,0,2))+(AG106-25)*vd_temp_coeff/1000)))","v":0.23753863667387551},{"$f":"IF(AH107<I_Vd1,Vd_1+(AH106-25)*vd_temp_coeff/1000,IF(AH107=0,0,IF(Reset=1,0.45,FORECAST(AH107, OFFSET(Vd_1:Vd_3,MATCH(AH107,I_Vd1:I_Vd3,1)-1,0,2), OFFSET(I_Vd1:I_Vd3,MATCH(AH107,I_Vd1:I_Vd3,1)-1,0,2))+(AH106-25)*vd_temp_coeff/1000)))","v":0.23736491593653472},{"$f":"IF(AI107<I_Vd1,Vd_1+(AI106-25)*vd_temp_coeff/1000,IF(AI107=0,0,IF(Reset=1,0.45,FORECAST(AI107, OFFSET(Vd_1:Vd_3,MATCH(AI107,I_Vd1:I_Vd3,1)-1,0,2), OFFSET(I_Vd1:I_Vd3,MATCH(AI107,I_Vd1:I_Vd3,1)-1,0,2))+(AI106-25)*vd_temp_coeff/1000)))","v":0.23719808563040878},{"$f":"IF(AJ107<I_Vd1,Vd_1+(AJ106-25)*vd_temp_coeff/1000,IF(AJ107=0,0,IF(Reset=1,0.45,FORECAST(AJ107, OFFSET(Vd_1:Vd_3,MATCH(AJ107,I_Vd1:I_Vd3,1)-1,0,2), OFFSET(I_Vd1:I_Vd3,MATCH(AJ107,I_Vd1:I_Vd3,1)-1,0,2))+(AJ106-25)*vd_temp_coeff/1000)))","v":0.23703774401772984},{"$f":"IF(AK107<I_Vd1,Vd_1+(AK106-25)*vd_temp_coeff/1000,IF(AK107=0,0,IF(Reset=1,0.45,FORECAST(AK107, OFFSET(Vd_1:Vd_3,MATCH(AK107,I_Vd1:I_Vd3,1)-1,0,2), OFFSET(I_Vd1:I_Vd3,MATCH(AK107,I_Vd1:I_Vd3,1)-1,0,2))+(AK106-25)*vd_temp_coeff/1000)))","v":0.23688351997800175},{"$f":"IF(AL107<I_Vd1,Vd_1+(AL106-25)*vd_temp_coeff/1000,IF(AL107=0,0,IF(Reset=1,0.45,FORECAST(AL107, OFFSET(Vd_1:Vd_3,MATCH(AL107,I_Vd1:I_Vd3,1)-1,0,2), OFFSET(I_Vd1:I_Vd3,MATCH(AL107,I_Vd1:I_Vd3,1)-1,0,2))+(AL106-25)*vd_temp_coeff/1000)))","v":0.23673507014737835},{"$f":"IF(AM107<I_Vd1,Vd_1+(AM106-25)*vd_temp_coeff/1000,IF(AM107=0,0,IF(Reset=1,0.45,FORECAST(AM107, OFFSET(Vd_1:Vd_3,MATCH(AM107,I_Vd1:I_Vd3,1)-1,0,2), OFFSET(I_Vd1:I_Vd3,MATCH(AM107,I_Vd1:I_Vd3,1)-1,0,2))+(AM106-25)*vd_temp_coeff/1000)))","v":0.23659207637271551},{"$f":"IF(AN107<I_Vd1,Vd_1+(AN106-25)*vd_temp_coeff/1000,IF(AN107=0,0,IF(Reset=1,0.45,FORECAST(AN107, OFFSET(Vd_1:Vd_3,MATCH(AN107,I_Vd1:I_Vd3,1)-1,0,2), OFFSET(I_Vd1:I_Vd3,MATCH(AN107,I_Vd1:I_Vd3,1)-1,0,2))+(AN106-25)*vd_temp_coeff/1000)))","v":0.23645424344066002},{"$f":"IF(AO107<I_Vd1,Vd_1+(AO106-25)*vd_temp_coeff/1000,IF(AO107=0,0,IF(Reset=1,0.45,FORECAST(AO107, OFFSET(Vd_1:Vd_3,MATCH(AO107,I_Vd1:I_Vd3,1)-1,0,2), OFFSET(I_Vd1:I_Vd3,MATCH(AO107,I_Vd1:I_Vd3,1)-1,0,2))+(AO106-25)*vd_temp_coeff/1000)))","v":0.23632129704774291},{"$f":"IF(AP107<I_Vd1,Vd_1+(AP106-25)*vd_temp_coeff/1000,IF(AP107=0,0,IF(Reset=1,0.45,FORECAST(AP107, OFFSET(Vd_1:Vd_3,MATCH(AP107,I_Vd1:I_Vd3,1)-1,0,2), OFFSET(I_Vd1:I_Vd3,MATCH(AP107,I_Vd1:I_Vd3,1)-1,0,2))+(AP106-25)*vd_temp_coeff/1000)))","v":0.23619298198216879},{"$f":"IF(AQ107<I_Vd1,Vd_1+(AQ106-25)*vd_temp_coeff/1000,IF(AQ107=0,0,IF(Reset=1,0.45,FORECAST(AQ107, OFFSET(Vd_1:Vd_3,MATCH(AQ107,I_Vd1:I_Vd3,1)-1,0,2), OFFSET(I_Vd1:I_Vd3,MATCH(AQ107,I_Vd1:I_Vd3,1)-1,0,2))+(AQ106-25)*vd_temp_coeff/1000)))","v":0.23606906049199775},{"$f":"IF(AR107<I_Vd1,Vd_1+(AR106-25)*vd_temp_coeff/1000,IF(AR107=0,0,IF(Reset=1,0.45,FORECAST(AR107, OFFSET(Vd_1:Vd_3,MATCH(AR107,I_Vd1:I_Vd3,1)-1,0,2), OFFSET(I_Vd1:I_Vd3,MATCH(AR107,I_Vd1:I_Vd3,1)-1,0,2))+(AR106-25)*vd_temp_coeff/1000)))","v":0.23594931081781009},{"$f":"IF(AS107<I_Vd1,Vd_1+(AS106-25)*vd_temp_coeff/1000,IF(AS107=0,0,IF(Reset=1,0.45,FORECAST(AS107, OFFSET(Vd_1:Vd_3,MATCH(AS107,I_Vd1:I_Vd3,1)-1,0,2), OFFSET(I_Vd1:I_Vd3,MATCH(AS107,I_Vd1:I_Vd3,1)-1,0,2))+(AS106-25)*vd_temp_coeff/1000)))","v":0.2358335258708403},{"$f":"IF(AT107<I_Vd1,Vd_1+(AT106-25)*vd_temp_coeff/1000,IF(AT107=0,0,IF(Reset=1,0.45,FORECAST(AT107, OFFSET(Vd_1:Vd_3,MATCH(AT107,I_Vd1:I_Vd3,1)-1,0,2), OFFSET(I_Vd1:I_Vd3,MATCH(AT107,I_Vd1:I_Vd3,1)-1,0,2))+(AT106-25)*vd_temp_coeff/1000)))","v":0.23572151204003522},{"$f":"IF(AU107<I_Vd1,Vd_1+(AU106-25)*vd_temp_coeff/1000,IF(AU107=0,0,IF(Reset=1,0.45,FORECAST(AU107, OFFSET(Vd_1:Vd_3,MATCH(AU107,I_Vd1:I_Vd3,1)-1,0,2), OFFSET(I_Vd1:I_Vd3,MATCH(AU107,I_Vd1:I_Vd3,1)-1,0,2))+(AU106-25)*vd_temp_coeff/1000)))","v":0.23561308811360698},{"$f":"IF(AV107<I_Vd1,Vd_1+(AV106-25)*vd_temp_coeff/1000,IF(AV107=0,0,IF(Reset=1,0.45,FORECAST(AV107, OFFSET(Vd_1:Vd_3,MATCH(AV107,I_Vd1:I_Vd3,1)-1,0,2), OFFSET(I_Vd1:I_Vd3,MATCH(AV107,I_Vd1:I_Vd3,1)-1,0,2))+(AV106-25)*vd_temp_coeff/1000)))","v":0.23550808430246725},{"$f":"IF(AW107<I_Vd1,Vd_1+(AW106-25)*vd_temp_coeff/1000,IF(AW107=0,0,IF(Reset=1,0.45,FORECAST(AW107, OFFSET(Vd_1:Vd_3,MATCH(AW107,I_Vd1:I_Vd3,1)-1,0,2), OFFSET(I_Vd1:I_Vd3,MATCH(AW107,I_Vd1:I_Vd3,1)-1,0,2))+(AW106-25)*vd_temp_coeff/1000)))","v":0.23540634135449282},{"$f":"IF(AX107<I_Vd1,Vd_1+(AX106-25)*vd_temp_coeff/1000,IF(AX107=0,0,IF(Reset=1,0.45,FORECAST(AX107, OFFSET(Vd_1:Vd_3,MATCH(AX107,I_Vd1:I_Vd3,1)-1,0,2), OFFSET(I_Vd1:I_Vd3,MATCH(AX107,I_Vd1:I_Vd3,1)-1,0,2))+(AX106-25)*vd_temp_coeff/1000)))","v":0.23530770974991896},{"$f":"IF(AY107<I_Vd1,Vd_1+(AY106-25)*vd_temp_coeff/1000,IF(AY107=0,0,IF(Reset=1,0.45,FORECAST(AY107, OFFSET(Vd_1:Vd_3,MATCH(AY107,I_Vd1:I_Vd3,1)-1,0,2), OFFSET(I_Vd1:I_Vd3,MATCH(AY107,I_Vd1:I_Vd3,1)-1,0,2))+(AY106-25)*vd_temp_coeff/1000)))","v":0.23521204896932651},{"$f":"IF(AZ107<I_Vd1,Vd_1+(AZ106-25)*vd_temp_coeff/1000,IF(AZ107=0,0,IF(Reset=1,0.45,FORECAST(AZ107, OFFSET(Vd_1:Vd_3,MATCH(AZ107,I_Vd1:I_Vd3,1)-1,0,2), OFFSET(I_Vd1:I_Vd3,MATCH(AZ107,I_Vd1:I_Vd3,1)-1,0,2))+(AZ106-25)*vd_temp_coeff/1000)))","v":0.23511922682669553},{"$f":"IF(BA107<I_Vd1,Vd_1+(BA106-25)*vd_temp_coeff/1000,IF(BA107=0,0,IF(Reset=1,0.45,FORECAST(BA107, OFFSET(Vd_1:Vd_3,MATCH(BA107,I_Vd1:I_Vd3,1)-1,0,2), OFFSET(I_Vd1:I_Vd3,MATCH(BA107,I_Vd1:I_Vd3,1)-1,0,2))+(BA106-25)*vd_temp_coeff/1000)))","v":0.23502911886088007},{"$f":"IF(BB107<I_Vd1,Vd_1+(BB106-25)*vd_temp_coeff/1000,IF(BB107=0,0,IF(Reset=1,0.45,FORECAST(BB107, OFFSET(Vd_1:Vd_3,MATCH(BB107,I_Vd1:I_Vd3,1)-1,0,2), OFFSET(I_Vd1:I_Vd3,MATCH(BB107,I_Vd1:I_Vd3,1)-1,0,2))+(BB106-25)*vd_temp_coeff/1000)))","v":0.23494160777962114},{"$f":"IF(BC107<I_Vd1,Vd_1+(BC106-25)*vd_temp_coeff/1000,IF(BC107=0,0,IF(Reset=1,0.45,FORECAST(BC107, OFFSET(Vd_1:Vd_3,MATCH(BC107,I_Vd1:I_Vd3,1)-1,0,2), OFFSET(I_Vd1:I_Vd3,MATCH(BC107,I_Vd1:I_Vd3,1)-1,0,2))+(BC106-25)*vd_temp_coeff/1000)))","v":0.23485658295088271},{"$f":"IF(BD107<I_Vd1,Vd_1+(BD106-25)*vd_temp_coeff/1000,IF(BD107=0,0,IF(Reset=1,0.45,FORECAST(BD107, OFFSET(Vd_1:Vd_3,MATCH(BD107,I_Vd1:I_Vd3,1)-1,0,2), OFFSET(I_Vd1:I_Vd3,MATCH(BD107,I_Vd1:I_Vd3,1)-1,0,2))+(BD106-25)*vd_temp_coeff/1000)))","v":0.23477393993687848},{"$f":"IF(BE107<I_Vd1,Vd_1+(BE106-25)*vd_temp_coeff/1000,IF(BE107=0,0,IF(Reset=1,0.45,FORECAST(BE107, OFFSET(Vd_1:Vd_3,MATCH(BE107,I_Vd1:I_Vd3,1)-1,0,2), OFFSET(I_Vd1:I_Vd3,MATCH(BE107,I_Vd1:I_Vd3,1)-1,0,2))+(BE106-25)*vd_temp_coeff/1000)))","v":0.23469358006666871},{"$f":"IF(BF107<I_Vd1,Vd_1+(BF106-25)*vd_temp_coeff/1000,IF(BF107=0,0,IF(Reset=1,0.45,FORECAST(BF107, OFFSET(Vd_1:Vd_3,MATCH(BF107,I_Vd1:I_Vd3,1)-1,0,2), OFFSET(I_Vd1:I_Vd3,MATCH(BF107,I_Vd1:I_Vd3,1)-1,0,2))+(BF106-25)*vd_temp_coeff/1000)))","v":0.23461541004365388},{"$f":"IF(BG107<I_Vd1,Vd_1+(BG106-25)*vd_temp_coeff/1000,IF(BG107=0,0,IF(Reset=1,0.45,FORECAST(BG107, OFFSET(Vd_1:Vd_3,MATCH(BG107,I_Vd1:I_Vd3,1)-1,0,2), OFFSET(I_Vd1:I_Vd3,MATCH(BG107,I_Vd1:I_Vd3,1)-1,0,2))+(BG106-25)*vd_temp_coeff/1000)))","v":0.2345393415846867},{"$f":"IF(BH107<I_Vd1,Vd_1+(BH106-25)*vd_temp_coeff/1000,IF(BH107=0,0,IF(Reset=1,0.45,FORECAST(BH107, OFFSET(Vd_1:Vd_3,MATCH(BH107,I_Vd1:I_Vd3,1)-1,0,2), OFFSET(I_Vd1:I_Vd3,MATCH(BH107,I_Vd1:I_Vd3,1)-1,0,2))+(BH106-25)*vd_temp_coeff/1000)))","v":0.23446529108787093},{"$f":"IF(BI107<I_Vd1,Vd_1+(BI106-25)*vd_temp_coeff/1000,IF(BI107=0,0,IF(Reset=1,0.45,FORECAST(BI107, OFFSET(Vd_1:Vd_3,MATCH(BI107,I_Vd1:I_Vd3,1)-1,0,2), OFFSET(I_Vd1:I_Vd3,MATCH(BI107,I_Vd1:I_Vd3,1)-1,0,2))+(BI106-25)*vd_temp_coeff/1000)))","v":0.231686968283878},"Vf buck diode"]
[null,null,null,null,null,null,null,null,"Pdiss buck diode",{"$f":"J108*J84","v":7.9207787962430096E-2},2.1157992219407024E-2,2.5146746999329832E-2,2.8855277511543053E-2,3.2422412767337622E-2,3.5645055368003824E-2,3.8662982941675063E-2,4.1495072805515607E-2,4.4157953746092216E-2,4.6666330682778007E-2,4.903325472720424E-2,5.1270349048031988E-2,5.3387998745215652E-2,5.5395511244216503E-2,5.7301252409971096E-2,5.9112762559024416E-2,6.0836855746928889E-2,6.2479705075382287E-2,6.4046916261104883E-2,6.5543591307080748E-2,6.6974383794417572E-2,6.83435470528196E-2,6.9654976256510084E-2,7.0912245320309097E-2,7.211863932962026E-2,7.3277183122161332E-2,7.4390666543542913E-2,7.5461666819432657E-2,7.6492568420983773E-2,7.7485580745031313E-2,7.8442753884305355E-2,7.9365992724007906E-2,{"$f":"AP108*AP84","v":8.0257069568272457E-2},8.1117635472237992E-2,8.1949230431874548E-2,8.2753292563609096E-2,8.3531166388644315E-2,8.4284110322174047E-2,8.5013303455088618E-2,8.5719851704911351E-2,8.6404793403340549E-2,8.7069104379676909E-2,8.7713702592392181E-2,8.8339452354999626E-2,8.8947168197075516E-2,8.953761839664813E-2,9.0111528216121992E-2,9.0669582870356369E-2,9.1212430252403609E-2,9.1740683439675952E-2,9.2254923000896494E-2,0.11154883136195869,"Pdiss buck diode"]
[null,null,null,null,null,null,null,null,"I_IN",{"$f":"(J111+J112)/J65","v":0.30359500415177892},{"$f":"(K111+K112)/K65","v":0.60224728279068562},0.58208389590687015,0.56327425055970892,0.5452252115573919,0.52877713103724167,0.51333599144407405,0.49881353973639492,0.48513153249991553,0.47222035734973455,0.4600178758627127,0.44846844762713139,0.43752210320165702,0.42713384015426376,0.41726302134458304,0.40787285854654676,0.39892996762608013,0.39040398397443127,0.3822672288907269,0.37449441921360116,0.36706241380289778,0.35994999153147844,0.35313765631314686,0.34660746540387405,0.34034287780007794,0.33432862004339814,0.32855056714516939,0.32299563668065923,0.31765169438522795,0.31250746982155997,0.30755248088691972,0.30277696609833682,0.29817182373694945,0.29372855705466405,0.28943922485032092,0.28529639681155744,0.28129311309490701,0.27742284768232883,0.27367947510897528,0.27005724020592059,0.26655073054395462,0.26315485130133714,0.25986480231041698,0.25667605706593505,0.25358434350221454,0.25058562636779202,0.24767609104477128,0.24485212867663575,0.24211032248274977,0.2394474351505495,0.23686039720772603,0.1264133194516211]
[null,null,null,null,null,null,null,null,"Pout",{"$f":"J77*Iout_PreReg","v":3.0494999999999997},3.0494999999999997,3.0494999999999997,3.0494999999999997,3.0494999999999992,3.0494999999999997,3.0494999999999997,3.0494999999999997,3.0494999999999997,3.0494999999999992,3.0494999999999992,3.0494999999999992,3.0495000000000001,3.0494999999999992,3.0495000000000005,3.0494999999999997,3.0494999999999992,3.0494999999999992,3.0495000000000001,3.0494999999999992,3.0495000000000001,3.0494999999999992,3.0494999999999997,3.0494999999999997,3.0495000000000001,3.0494999999999992,3.0495000000000001,3.0495000000000001,3.0495000000000001,3.0494999999999997,3.0494999999999997,3.0494999999999992,{"$f":"AP77*Iout_PreReg","v":3.0494999999999997},3.0494999999999992,3.0494999999999997,3.0494999999999992,3.0494999999999997,3.0494999999999997,3.0494999999999997,3.0494999999999992,3.0494999999999992,3.0495000000000001,3.0494999999999997,3.0494999999999997,3.0494999999999997,3.0494999999999997,3.0495000000000005,3.0494999999999992,3.0494999999999997,3.0494999999999983,3.0495000000000001,3.0495000000000001]
[null,null,null,null,null,null,null,null,"P loss",{"$f":"J66+J109+J82^2*dcr*10^-3","v":1.0490325560490157},0.86510733813945706,0.87065684998504456,0.87617666461511479,0.87834693223998683,0.88395437271580823,0.88956801597901725,0.89519891118067441,0.90085676464216924,0.90655013657277694,0.91228660436866926,0.91807289890533639,0.92391501887219074,0.92981832715145762,0.93578763243397567,0.94182725863406502,0.94794110417153776,0.9541326927990148,0.96040521734354312,0.96676157748464164,0.97320441249298117,0.9797361296942031,0.98635892929310665,0.99307482608804087,0.99988566851929361,1.006793155424494,1.0137988508157674,1.0209041969450416,1.0281105258838441,1.0354190698103907,1.0428309701688092,1.0503472858417646,{"$f":"AP66+AP109+AP82^2*dcr*10^-3","v":1.0579690004579776},1.0656970289393237,1.0735322233780407,1.0814753783224491,1.0895272355393448,1.0976884883123639,1.1059597853281147,1.114341734195367,1.1228349046370034,1.1314398313896106,1.1401570168414157,1.1489869334356517,1.1579300258632734,1.1669867130662144,1.1761573900699744,1.1854424296622204,1.194842183932286,1.2043569856847633,{"$f":"BH66+BH109+BH82^2*dcr*10^-3","v":1.2139871497390677},1.5013795002583596]
[null,null,null,null,null,null,null,null,"Efficiency",{"$f":"J111/(J111+J112)","v":0.74404679194245982},0.77900533478521827,0.77790254744823129,0.77680875439571695,0.77637954141479737,0.77527275291476383,0.77416789647438367,0.77306280369247871,0.77195559330100894,0.77084462904250661,0.76972848477939493,0.76860591543040446,0.76747583263164043,0.76633728425113057,0.76518943706393094,0.76403156203323142,0.76286302175101162,0.76168325967686035,0.76049179088083629,0.75928819404982129,0.75807210455966378,0.7568432084498955,0.75560123716567296,0.75434596295425171,0.75307719482177304,0.75179477497130442,0.75049857565553357,0.7491884963878378,0.74786446146398555,0.74652641775386464,0.74517433272856903,0.74380819269317933,{"$f":"AP111/(AP111+AP112)","v":0.74242800119976193},0.74103377761866163,0.73962555584916456,0.73820338315315104,0.73676731909753379,0.73531743459312793,0.73385381101918468,0.7323765394241849,0.73088571979465988,0.72938146038481588,0.7278638771006174,0.72633309293273718,0.72478923743343981,0.72323244623304273,0.72166286059208939,0.72008062698581432,0.71848589671785312,0.71687882556049487,0.71525957341905777,0.67009025394473221]
[]
[]
[]
[]
[]
[]
[]
[]
[]
[]
[]
[]
[]
[]
[]
[]
[]
[]
[]
[]
[]
[]
[]
[]
[]
[]
[]
[]
[]
[]
[]
[]
[]
[]
[]
[]
[]
[]
[]
[]
[]
[]
[]
[]
[]
[]
[]
[]
[]
[]
[]
[]
[]
[]
[]
[]
[]
[]
[]
[]
[]
[]
["For Plots"]
["Vin",{"$f":"Vin_min_bb","v":3.5},{"$f":"Vin_max_buck","v":18}]
["Ta",{"$f":"Ta","v":125},{"$f":"Ta","v":125}]
["Tjmax",165,165]
["Vin",2,18]
["5V out",4.75,4.75]
["Vin",0,14]
["Max buck duty",{"$f":"(1/(fsw*10^3)-t_off_min*10^-9)*fsw*10^3","v":0.82399999999999984},{"$f":"(1/(fsw*10^3)-t_off_min*10^-9)*fsw*10^3","v":0.82399999999999984}]

{"sheet":"Control Loop","index":1,"n_rows":138,"n_cols":21,"rows_kept":138,"cut":false,"hidden":true,"merged":[[31,17,31,18],[0,1,0,2],[0,4,0,5],[31,3,31,4],[31,5,31,6],[31,7,31,8],[31,15,31,16]]}
[null,"Series RC with Parallel C",null,null,"No feedforward C"]
[null,"Rz",{"$f":"Rz","v":18.2},"kΩ","Cz2",39,"pF"]
[null,"Cz",{"$f":"Cz","v":1.5},"nF","Rz2",0,"kΩ"]
[null,"Cp",{"$f":"Cp","v":68},"pF"]
[null,null,null,null,"AVOL",60,"dB"]
[null,"Ro_EA",350,"kΩ",null,{"$f":"10^(F5/20)","v":1000},"V/V"]
[null,"Cstray",0,"pF","gm_EA1",720,"uA/V"]
[null,null,null,null,"RFB1",{"$f":"(Vreg-VFB)/VFB*RFB_2","v":56.874999999999993},"kΩ"]
[null,"Cp +Cstray",{"$f":"IF(Type=RCC,Cp+Cstray,IF(Type=RCRC,Cp+Cstray,Cstray))","v":68},"pF","RFB2",10,"kΩ"]
[null,null,null,null,"FB Gain",{"$f":"RFB_2/(RFB_1+RFB_2)","v":0.14953271028037382}]
[null,"Cout derating",0,null,"VFB",0.8,"V"]
[null,"Cout",{"$f":"(1-C11)*Cout1","v":10},"uF"]
[null,null,null,null,"Ri",{"$f":"1/gm_POWER1","v":0.21881838074398249}]
[null,"Series RC",null,null,"gmPOWER1",4.57,"A/V"]
[null,"Series RC with Parallel C",null,null,"K",{"$f":"Vreg/(Iout_PreReg*Ri*(1+Vreg*(m_c*(1-Vreg/Vin_nom)-0.5)/(Iout_PreReg*fsw*10^3*L_buck*10^-6)))","v":27.563110647181627}]
[null,null,null,null,"mc",{"$f":"(1+Se/Sn)","v":2.9877300613496933}]
[null,"No feedforward C",null,null,"Se typ",1.62,"A/us"]
[null,"Feedforward RC",null,null,"Se min",1.1000000000000001,"A/us"]
["Error Amp",null,null,null,"Se max",2.15,"A/us"]
["fp2",{"$f":"1/(2*PI()*Ro_EA*10^3*Cz*10^-9)*10^-3","v":0.30315227255599114},null,null,"Sn",{"$f":"(Vin_nom-Vreg)/L_buck","v":0.81500000000000006},"A/us"]
["fp3",{"$f":"1/(2*PI()*Rz*10^3*Cp_Cstray*10^-12)*10^-3","v":128.59966313178359},null,null,"wn",{"$f":"PI()*fsw*10^3","v":6911503.8378975447}]
["fz2",{"$f":"1/(2*PI()*Rz*10^3*Cz*10^-9)*10^-3","v":5.8298513953075215},null,null,"Qp",{"$f":"1/(PI()*(m_c*(1-Vreg/Vin_nom)-0.5))","v":0.24415815133415758}]
[]
[null,"Calculated"]
["fco",{"$f":"VLOOKUP(MIN(A36:A135),A36:I135,2,FALSE)","v":31.992671377973799},null,null,"wp",{"$f":"(1/(Vreg/Iout_PreReg*Number_Cout*Co*10^-6)+(m_c*(1-Vreg/Vin_nom)-0.5)/(fsw*10^3*L_buck*10^-6*Number_Cout*Co*10^-6))/(1000)","v":4.1450328833506411},"Rad"]
["PM",{"$f":"VLOOKUP(MIN(A36:A135),A36:I135,9,FALSE)","v":62.328764878725991},null,null,"wz",{"$f":"1/(ESR*10^-3*Co*10^-6*1000)","v":20000},"Rad"]
[]
[]
[null,null,null,{"$f":"20*LOG(VFB/Vreg*gmc)","v":43.494724099414306},"dB",{"$f":"20*LOG(gm_EA1*C2*FB_Gain1*10^-3)","v":5.8428017877411689}]
[null,null,null,{"$f":"20*LOG(VFB/Vreg*gm_EA1*Ro_EA*10^-3)","v":31.522734915045184}]
[]
[null,null,null,"Error Amplifier",null,"Control to Output",null,"Total System",null,"Error Amp"]
["Calculated",null,"Frequency","Gain","Phase","Gain","Phase","Total Gain","Total Phase","ZCz","ZCp","ZT(s)","RFB1 with or without feedforward C","Tv(s)","1 + s/ωP","1 + s/ωZ","fp(s)","fh(s)","fp(s)fh(s)","Gain","Phase"]
[{"$f":"ABS(H34)","v":0.84192182331567977},{"$f":"C34/1000","v":35},{"$f":"fc*1000","v":35000},{"$f":"20*LOG(IMABS(N34))","v":4.9114148157640161},{"$f":"IF(180/PI()*IMARGUMENT(N34)>0,180/PI()*IMARGUMENT(N34),360+180/PI()*IMARGUMENT(N34))","v":157.04053150983901},{"$f":"T34","v":-5.7533366390796958},{"$f":"U34","v":-95.722470020933102},{"$f":"D34+F34","v":-0.84192182331567977},{"$f":"E34+G34","v":61.318061488905911},{"$f":"IMDIV(1,COMPLEX(0,2*PI()*$C34*Cz*10^-9))","v":"-3031.52272555991i"},{"$f":"IMDIV(1,COMPLEX(0,2*PI()*$C34*Cp_Cstray*10^-12))","v":"-66871.8248285275i"},{"$f":"IMDIV(IMPRODUCT(IMDIV(IMPRODUCT(K34,IMSUM(Rz*10^3,J34)),IMSUM(K34,IMSUM(Rz*10^3,J34))),Ro_EA*10^3),IMSUM(IMDIV(IMPRODUCT(K34,IMSUM(Rz*10^3,J34)),IMSUM(K34,IMSUM(Rz*10^3,J34))),Ro_EA*10^3))","v":"15054.2249937871-6377.57486255491i"},{"$f":"IF($E$1=\"Feedforward RC\",IMDIV(IMPRODUCT(IMSUM(Rz_2*10^3,IMDIV(1,COMPLEX(0,2*PI()*$C34*Cz_2*10^-12))),RFB_1*10^3),IMSUM(IMSUM(Rz_2*10^3,IMDIV(1,COMPLEX(0,2*PI()*$C34*Cz_2*10^-12))),RFB_1*10^3)),RFB_1*10^3)","v":56874.999999999993},{"$f":"IMPRODUCT(-gm_EA1*10^-6,L34,IMDIV(RFB_2*10^3,IMSUM(M34,RFB_2*10^3)))","v":"-1.6207913264339+0.68663235903395i"},{"$f":"COMPLEX(1,2*PI()*C34*1/(1/(Vreg/Iout_PreReg*Number_Cout*Co*10^-6)+(m_c*(1-Vreg/Vin_nom)-0.5)/(fsw*10^3*L_buck*10^-6*Number_Cout*Co*10^-6)))","v":"1+53.0542198192454i"},{"$f":"COMPLEX(1,2*PI()*C34*(ESR*10^-3*Co*10^-6))","v":"1+0.0109955742875643i"},{"$f":"IMPRODUCT(K,IMDIV(P34,O34))","v":"0.0154993758917437-0.519235064904244i"},{"$f":"IMDIV(1,IMSUM(COMPLEX(1,2*PI()*C34/(wn*Qp)),IMPRODUCT(COMPLEX(0,2*PI()*C34/wn),COMPLEX(0,2*PI()*C34/wn))))","v":"0.98426400671493-0.128397224533482i"},{"$f":"IMPRODUCT(Q34,R34)","v":"-0.0514128633973789-0.513054462256039i"},{"$f":"20*LOG(IMABS(S34))","v":-5.7533366390796958},{"$f":"180/PI()*IMARGUMENT(S34)","v":-95.722470020933102}]
[]
[{"$f":"ABS(H36)","v":59.699162055533364},{"$f":"C36/1000","v":0.1},100,{"$f":"20*LOG(IMABS(N36))","v":30.991259053254396},{"$f":"IF(180/PI()*IMARGUMENT(N36)>0,180/PI()*IMARGUMENT(N36),360+180/PI()*IMARGUMENT(N36))","v":161.07904462034753},{"$f":"T36","v":28.707903002278972},{"$f":"U36","v":-8.6390088452981075},{"$f":"D36+F36","v":59.699162055533364},{"$f":"E36+G36","v":152.44003577504941},{"$f":"IMDIV(1,COMPLEX(0,2*PI()*$C36*Cz*10^-9))","v":"-1061032.95394597i"},{"$f":"IMDIV(1,COMPLEX(0,2*PI()*$C36*Cp_Cstray*10^-12))","v":"-23405138.6899846i"},{"$f":"IMDIV(IMPRODUCT(IMDIV(IMPRODUCT(K36,IMSUM(Rz*10^3,J36)),IMSUM(K36,IMSUM(Rz*10^3,J36))),Ro_EA*10^3),IMSUM(IMDIV(IMPRODUCT(K36,IMSUM(Rz*10^3,J36)),IMSUM(K36,IMSUM(Rz*10^3,J36))),Ro_EA*10^3))","v":"311436.964415332-106755.979018217i"},{"$f":"IF($E$1=\"Feedforward RC\",IMDIV(IMPRODUCT(IMSUM(Rz_2*10^3,IMDIV(1,COMPLEX(0,2*PI()*$C36*Cz_2*10^-12))),RFB_1*10^3),IMSUM(IMSUM(Rz_2*10^3,IMDIV(1,COMPLEX(0,2*PI()*$C36*Cz_2*10^-12))),RFB_1*10^3)),RFB_1*10^3)","v":56874.999999999993},{"$f":"IMPRODUCT(-gm_EA1*10^-6,L36,IMDIV(RFB_2*10^3,IMSUM(M36,RFB_2*10^3)))","v":"-33.5304096267722+11.4937278344847i"},{"$f":"COMPLEX(1,2*PI()*C36*1/(1/(Vreg/Iout_PreReg*Number_Cout*Co*10^-6)+(m_c*(1-Vreg/Vin_nom)-0.5)/(fsw*10^3*L_buck*10^-6*Number_Cout*Co*10^-6)))","v":"1+0.151583485197844i"},{"$f":"COMPLEX(1,2*PI()*C36*(ESR*10^-3*Co*10^-6))","v":"1+0.0000314159265358979i"},{"$f":"IMPRODUCT(K,IMDIV(P36,O36))","v":"26.9441316928531-4.08341946697318i"},{"$f":"IMDIV(1,IMSUM(COMPLEX(1,2*PI()*C36/(wn*Qp)),IMPRODUCT(COMPLEX(0,2*PI()*C36/wn),COMPLEX(0,2*PI()*C36/wn))))","v":"0.999999869629706-0.000372336861627616i"},{"$f":"IMPRODUCT(Q36,R36)","v":"26.9426077725497-4.09345122805038i"},{"$f":"20*LOG(IMABS(S36))","v":28.707903002278972},{"$f":"180/PI()*IMARGUMENT(S36)","v":-8.6390088452981075}]
[{"$f":"ABS(H37)","v":59.578178803135152},0.109749876549306,109.74987654930599,{"$f":"20*LOG(IMABS(N37))","v":30.890179308100464},{"$f":"IF(180/PI()*IMARGUMENT(N37)>0,180/PI()*IMARGUMENT(N37),360+180/PI()*IMARGUMENT(N37))","v":159.40615925675169},{"$f":"T37","v":28.687999495034688},-9.4668132010740802,{"$f":"D37+F37","v":59.578178803135152},149.93934605567762,"-966773.710646764i","-21325890.6760316i",{"$f":"IMDIV(IMPRODUCT(IMDIV(IMPRODUCT(K37,IMSUM(Rz*10^3,J37)),IMSUM(K37,IMSUM(Rz*10^3,J37))),Ro_EA*10^3),IMSUM(IMDIV(IMPRODUCT(K37,IMSUM(Rz*10^3,J37)),IMSUM(K37,IMSUM(Rz*10^3,J37))),Ro_EA*10^3))","v":"304622.011264867-114462.514816647i"},56874.999999999993,{"$f":"IMPRODUCT(-gm_EA1*10^-6,L37,IMDIV(RFB_2*10^3,IMSUM(M37,RFB_2*10^3)))","v":"-32.7966875679558+12.3234408475493i"},"1+0.166362687873769i","1+0.0000344789405899686i",{"$f":"IMPRODUCT(K,IMDIV(P37,O37))","v":"26.820957345579-4.46105620850374i"},"0.999999842968524-0.000408639235779708i",{"$f":"IMPRODUCT(Q37,R37)","v":"26.8191301712447-4.47201560349008i"},{"$f":"20*LOG(IMABS(S37))","v":28.687999495034688},{"$f":"180/PI()*IMARGUMENT(S37)","v":-9.4668132010740802}]
[59.435633170409872,0.120450354025878,120.450354025878,30.771487043255267,157.61863404498217,28.664146127154602,-10.370778687805304,59.435633170409872,147.24785535717686,"-880888.198732913i","-19431357.3249906i","296819.46645316-122227.238199812i",56874.999999999993,"-31.9566378835552+13.159418542634i","1+0.182582844565568i","1+0.0000378405947329988i","26.674080719903-4.8691865295119i","0.999999810855037-0.000448481043310953i","26.6718919367802-4.88114842808042i",28.664146127154602,-10.370778687805304]
[59.268308466302273,0.13219411484660298,132.19411484660299,30.632720943532732,155.7174558950625,28.635587522769544,-11.356932786490839,59.268308466302273,144.36052310857167,"-802632.518987084i","-17705129.0953033i","287963.636210457-129914.964291527i",56874.999999999993,"-31.0031877490137+13.9871064358728i","1+0.200384446510921i","1+0.0000415300060049893i","26.4992895059207-5.30890076442589i","0.99999977217423-0.000492207373548752i","26.496670388598-5.3219427006101i",28.635587522769544,-11.356932786490839]
[59.072724274121455,0.14508287784959401,145.08287784959401,30.471288209863715,153.70605891539824,28.60143606425774,-12.43147788088906,59.072724274121455,141.2745810345092,"-731328.85814819i","-16132254.2238571i","278011.092428636-137365.061652482i",56874.999999999993,"-29.9316615399803+14.7892103760429i","1+0.219921682669745i","1+0.000045579130321395i","26.2917710594069-5.78087422914023i","0.999999725583065-0.000540196961263403i","26.2886410338076-5.79507537760297i",28.60143606425774,-12.43147788088906]
[58.845183257437824,0.15922827933410899,159.228279334109,30.284529352839499,151.59071488524725,28.560653904598322,-13.600695878560169,58.845183257437824,137.99001900668708,"-666359.6180171i","-14699109.2209654i","266949.374147995-144394.901209375i",56874.999999999993,"-28.7407176652795+15.5460678685234i","1+0.241363775235201i","1+0.000050023039259978i","26.0460901177343-6.28520385036659i","0.999999669463848-0.000592865466947661i","26.0423552282443-6.30064360025931i",28.560653904598322,-13.600695878560169]
[58.5818387158767,0.17475284000076802,174.752840000768,30.069803989299739,149.38084450294411,28.512034726576964,-14.870818044048249,58.5818387158767,134.51002645889588,"-607162.066116524i","-13393280.8702175i","254805.386786834-150806.491349349i",56874.999999999993,"-27.4332528577975+16.2363624331262i","1+0.264896445355376i","1+0.0000549002238340365i","25.7561959587038-6.82121153439305i","0.999999601868059-0.000650669076884163i","25.7517473529272-6.83796757889936i",28.512034726576964,-14.870818044048249]
[58.278781755382155,0.191791026167249,191.79102616724899,29.824595439386229,147.08919658244875,28.45418631599593,-16.247853640909607,58.278781755382155,130.84134294153915,"-553223.461571507i","-12203458.7111362i","241652.219619229-156396.474152647i",56874.999999999993,"-26.0171361683507+16.8381998340046i","1+0.290723521761025i","1+0.0000602529278831477i","25.415473432477-7.38721518539542i","0.999999520448705-0.000714108454168371i","25.4101859716372-7.40536104729164i",28.45418631599593,-16.247853640909607]
[57.93214404699431,0.21049041445120201,210.49041445120201,29.546628562865706,144.73184391036799,28.385515484128607,-17.737371575208766,57.93214404699431,126.99447233515922,"-504076.613993246i","-11119337.0733804i","227612.919167453-160969.083285188i",56874.999999999993,"-24.5056152225146+17.3305031723866i","1+0.319068706232518i","1+0.0000661275139690967i","25.0168552762172-7.9802729670044i","0.99999942237882-0.000783733074889653i","25.0105864220808-7.99987489433941i",28.385515484128607,-17.737371575208766]
[57.538209218826395,0.231012970008316,231.01297000831599,29.233991800779279,142.32795639013187,28.304217418047113,-19.344230947106151,57.538209218826395,122.98372544302572,"-459295.83689945i","-10131525.8139584i","212859.86444801-164350.958604651i",56874.999999999993,"-22.9172489573932+17.6946078796783i","1+0.350177511197655i","1+0.0000725748649462085i","24.5530151092925-8.59591333433774i","0.99999930425332-0.000860145987003212i","24.5456042862546-8.61702653117466i",28.304217418047113,-19.344230947106151]
[57.093523737153305,0.25353644939701103,253.53644939701101,28.885251627064498,139.89933525137783,28.208272110088807,-21.072259706609625,57.093523737153305,118.82707554476821,"-418493.260621673i","-9231468.98430161i","197608.876350203-166406.043607143i",56874.999999999993,"-21.2752734163957+17.9158656294793i","1+0.384319386242857i","1+0.000079650824684289i","24.0166602708-9.22787271038314i","0.999999161970772-0.000944009033078311i","24.007928948942-9.2505369213961i",28.208272110088807,-21.072259706609625]
[56.594997510755718,0.27825594022071298,278.255940220713,28.499546479716251,137.46972415191613,28.095451031039463,-22.923885913991665,56.594997510755718,114.54583823792446,"-381315.4727638i","-8411370.72273091i","182108.035438907-167048.383304755i",56874.999999999993,"-19.6063978341702+17.9850222025306i","1+0.421790051956586i","1+0.0000874166817615113i","23.4009395467062-9.86787403156634i","0.99999899059099-0.00103604858211558i","23.3906923286881-9.89210858108292i",28.095451031039463,-22.923885913991665]
[56.039985944675465,0.30538555088334196,305.38555088334198,28.076648420131352,135.06394809401857,27.963337524544116,-24.899733697809339,56.039985944675465,110.16421439620923,"-347440.457112945i","-7664127.7304326i","166622.21340575-166250.692206735i",56874.999999999993,"-17.9391392377032+17.8991399459962i","1+0.462914061319605i","1+0.0000959397003167579i","22.6999709757333-10.5054913596386i","0.999998784163508-0.0011370618200211i","22.6879979831546-10.5312898569909i",27.963337524544116,-24.899733697809339]
[55.426348713727435,0.33516026509388397,335.16026509388399,27.61698439374236,132.7069610233815,27.809364319985079,-26.998205763539566,55.426348713727435,105.70875525984192,"-316574.804489057i","-6983267.74608214i","151415.260987205-164047.152304006i",56874.999999999993,"-16.3019047343234+17.6618990144126i","1+0.508047610827642i","1+0.000105293702659415i","21.9094777738135-11.1281556154904i","0.999998535520981-0.00124792365314493i","21.8955585992345-11.155480674082i",27.809364319985079,-26.998205763539566]
[54.752485302688797,0.36783797718286304,367.83797718286303,27.121614437896767,130.42289980072914,27.630870864792026,-29.215085440206721,54.752485302688797,101.20781436052242,"-288451.171374971i","-6362893.48621259i","136732.340492307-160529.919945919i",56874.999999999993,"-14.7210893688914+17.2832212876354i","1+0.557581625695034i","1+0.000115559708682901i","21.0274956650756-11.7213600321913i","0.999998236030329-0.00136959428457708i","21.0114050655034-11.7501384939496i",27.630870864792026,-29.215085440206721]
[54.017351960155878,0.40370172585965503,403.70172585965503,26.592170294510726,128.23424112942243,27.425181665645155,-31.543202046342653,54.017351960155878,96.691039083079772,"-262825.96431476i","-5797631.56576677i","122784.856814074-155839.990926454i",56874.999999999993,"-13.2194537429732+16.7782868735771i","1+0.611945145861911i","1+0.000126826637620221i","20.0550846780273-12.2691159819226i","0.999997875293002-0.0015031275286879i","20.0366000208634-12.2992352635157i",27.425181665645155,-31.543202046342653]
[53.220467617943562,0.44306214575838798,443.062145758388,26.030763204211645,126.16113928754496,27.189704413731917,-33.972211111917233,53.220467617943562,92.188928175627723,"-239477.230023748i","-5282585.95640622i","109739.838961594-150154.055298511i",56874.999999999993,"-11.8149807928744+16.1661188508304i","1+0.671609042132916i","1+0.000139192078219828i","18.9969483770947-12.7546857363359i","0.999997440783936-0.0016496799357507i","18.9758586106532-12.7859919789175i",27.189704413731917,-33.972211111917233]
[52.361916512932041,0.48626015800653499,486.26015800653499,25.439873029027179,124.22099142755943,26.922043483904865,-36.488542348752212,52.361916512932041,87.732449078807207,"-218202.732935341i","-4813295.57945606i","97714.6603470166-143669.505011406i",56874.999999999993,"-10.5203073569872+15.4679691376766i","1+0.737090094634849i","1+0.000152763134012674i","17.8618427859348-13.1615767622719i","0.999996917416694-0.00181052080544361i","17.8379584167559-13.1938754286026i",26.922043483904865,-36.488542348752212]
[51.44235263516606,0.533669923120631,533.66992312063098,24.822231756608694,122.42824191453599,26.620120878557366,-39.075560042665678,51.44235263516606,83.352681871870317,"-198818.203533298i","-4385695.66617568i","86776.9637751801-136589.750874531i",56874.999999999993,"-9.34271609990725+14.7057376642486i","1+0.808955468918907i","1+0.00016765735099176i","16.6626570454372-13.4747263855103i","0.999996287019678-0.00198704317565042i","16.6358203142114-13.5077857730867i",26.620120878557366,-39.075560042665678]
[50.463006665878225,0.58570208180566707,585.70208180566704,24.180713086422362,120.79440570175728,26.282293579455867,-41.713961062930821,50.463006665878225,79.080444638826464,"-181155.74229733i","-3996082.55067638i","76948.8494098869-129111.556264647i",56874.999999999993,"-8.28458640375606+13.9006086744742i","1+0.887827628477358i","1+0.000184003735739293i","15.4160771834308-13.6817475308616i","0.999995527705225-0.00218077588132743i","15.3861714131596-13.7153053513599i",26.282293579455867,-41.713961062930821]
[49.425691406996236,0.64280731172843197,642.80731172843196,23.518236916998625,119.3282685652683,25.907454489997612,-44.382406117937094,49.425691406996236,74.945862447331209,"-165062.365437782i","-3641081.59053932i","68213.9415107949-121415.41129715i",56874.999999999993,"-7.34415519817157+13.0720143751698i","1+0.974389726224527i","1+0.000201943872819985i","14.1418049376026-13.7740632401602i","0.999994613109705-0.00239339678733848i","14.1087619585432-13.8078359912974i",25.907454489997612,-44.382406117937094]
[48.332798559935924,0.70548023107186497,705.48023107186498,22.837694060348571,118.03621106425911,25.495104499587349,-47.058344955047424,48.332798559935924,70.977866109211675,"-150398.679823232i","-3317617.93727717i","60525.8799296603-113659.273626368i",56874.999999999993,"-6.51643118495035+12.2369610483716i","1+1.06939152164054i","1+0.00022163315111882i","12.8613856414394-13.7477478624373i","0.999993511478235-0.00262674730915358i","12.8251903303542-13.7814422700017i",25.495104499587349,-47.058344955047424]
[47.187279232094753,0.774263682681127,774.26368268112697,22.141893202927175,116.92260219493583,25.045386029167581,-49.718963542752157,47.187279232094753,67.203638652183685,"-137037.675623867i","-3022889.90346766i","53816.9898140392-105975.448876404i",56874.999999999993,"-5.79412824913768+11.4096931874409i","1+1.17365587482923i","1+0.000243242109745241i","11.5967820087972-13.6039268245538i","0.999992184562234-0.00288284834622851i","11.5574733169207-13.637252267746i",25.045386029167581,-49.718963542752157]
[45.99260289016668,0.84975343590864494,849.75343590864497,21.433529518081762,115.99021488286408,24.559073372084921,-52.342159269209681,45.99260289016668,63.6480556136544,"-124863.626213103i","-2754344.69587727i","48006.233394294-98470.0432539939i",56874.999999999993,"-5.1685215766567+10.6016345634207i","1+1.28808587373875i","1+0.000266957915161328i","10.3688888680367-13.3486610867314i","0.999990586291574-0.00316391776481234i","10.3265571923914-13.381341738019i",24.559073372084921,-52.342159269209681]
[44.752693792489083,0.93260334688322,932.60334688321996,20.715172601592855,115.24062529174638,24.037521190896229,-54.907445001345742,44.752693792489083,60.333180290400641,"-113771.085798905i","-2509656.30438761i","43005.9213146572-91224.2851856313i",56874.999999999993,"-4.63017022004534+9.821530517182i","1+1.41367265627732i","1+0.000292985982328158i","9.19619786854193-12.9923378634245i","0.999988661175231-0.003472389579944i","9.15097913584969-13.024123327236i",24.037521190896229,-54.907445001345742]
[43.471848750825956,1.0235310218990299,1023.53102189903,19.989270494224535,114.67456852239343,23.482578256601421,-57.396695977002494,43.471848750825956,57.277872545390935,"-103663.976102782i","-2286705.35520842i","38726.9793498991-84297.0303293189i",56874.999999999993,"-4.16948413187699+9.07571765788556i","1+1.55150399507566i","1+0.000321551753911925i","8.09378601695881-12.5486783740272i","0.999986342374958-0.00381093500058061i","8.04585327743761-12.5793518813024i",23.482578256601421,-57.396695977002494]
[42.154643902445983,1.1233240329780299,1123.3240329780299,19.258166280430316,114.29223270633963,22.896477622015663,-59.79468118195642,42.154643902445983,54.497551524383212,"-94454.7541757011i","-2083560.75387576i","35082.7952226715-77727.8717475924i",56874.999999999993,"-3.77713832677735+8.36845871525482i","1+1.70277371925308i","1+0.000352902652960464i","7.07272978598105-12.0335313080758i","0.999983549385135-0.00418248551722834i","7.02228336481016-12.0629149389839i",22.896477622015663,-59.79468118195642]
[40.805840025987941,1.2328467394420699,1232.84673944207,18.524123875075897,114.09348081578828,22.281716150912043,-62.089355584149679,40.805840025987941,52.004125231638604,"-86063.6541429428i","-1898462.9590355i","31991.8081117991-71540.4199576183i",56874.999999999993,"-3.44435167708342+7.70229568141835i","1+1.86879205479427i","1+0.000387310225963334i","6.13996097857346-11.4636348188919i","0.999980185238324-0.00459025822820133i","6.08721827265746-11.4915916761028i",22.281716150912043,-62.089355584149679]
[39.430295568023482,1.35304777457981,1353.04777457981,17.789359913840407,114.07799453640905,21.640935654183071,-64.271922960564751,39.430295568023482,49.8060715758443,"-78417.9963102543i","-1729808.74213796i","29379.0668655524-65745.4588104788i",56874.999999999993,"-3.16305467561835+7.07838958408146i","1+2.05099697309994i","1+0.000425072494857595i","5.29850598739765-10.8555034218956i","0.999976133139605-0.00503778361878422i","5.24369185138247-10.8819370617783i",21.640935654183071,-64.271922960564751]
[38.032894382802134,1.48496826225446,1484.9682622544599,17.056078979767001,114.24533760569074,20.976815403035133,-66.336704527372007,38.032894382802134,47.908633078318729,"-71451.5576471059i","-1576137.3010391i","27176.9943760346-60343.8026234112i",56874.999999999993,"-2.92597173095251+6.49682809552989i","1+2.25096664600717i","1+0.000466516538351261i","4.54800286899405-10.2245441170852i","0.999971252413013-0.00552893602718402i","4.49134127455547-10.2493958030279i",20.976815403035133,-66.336704527372007]
[36.618492007286697,1.62975083462064,1629.75083462064,16.326509615552691,114.59493770915235,20.291982391734006,-68.280863031602138,36.618492007286697,46.314074677550209,"-65103.9981944816i","-1436117.60723121i","25325.5759853181-55328.7705524167i",56874.999999999993,"-2.72664145187724+5.95689193237235i","1+2.47043311515892i","1+0.000512001324922604i","3.88537515351001-9.58444709487651i","0.999965373619546-0.00606796705226304i","3.82708250784587-9.60769154858214i",20.291982391734006,-68.280863031602138]
[35.191880903423986,1.78864952905744,1788.6495290574401,15.602938627601644,115.12598708040733,19.58894227582234,-70.104035618981769,35.191880903423986,45.021951461425559,"-59320.3384290213i","-1308536.87711076i","23772.155338573-50688.256659211i",56874.999999999993,"-2.55939466822768+5.45727772630011i","1+2.71129729412009i","1+0.00056192082203337i","3.30555194582665-8.94684576050057i","0.999958292677587-0.00665954218066599i","3.24583218337993-8.96848607413347i",19.58894227582234,-70.104035618981769]
[33.757772101985594,1.9630406500402702,1963.0406500402701,14.887741069198206,115.83726314328568,18.870031032787388,-71.807924179484075,33.757772101985594,44.029338963801607,{"$f":"IMDIV(1,COMPLEX(0,2*PI()*$C68*Cz*10^-9))","v":"-54050.4830566909i"},{"$f":"IMDIV(1,COMPLEX(0,2*PI()*$C68*Cp_Cstray*10^-12))","v":"-1192290.067427i"},{"$f":"IMDIV(IMPRODUCT(IMDIV(IMPRODUCT(K68,IMSUM(Rz*10^3,J68)),IMSUM(K68,IMSUM(Rz*10^3,J68))),Ro_EA*10^3),IMSUM(IMDIV(IMPRODUCT(K68,IMSUM(Rz*10^3,J68)),IMSUM(K68,IMSUM(Rz*10^3,J68))),Ro_EA*10^3))","v":"22470.982586925-46406.4131684843i"},{"$f":"IF($E$1=\"Feedforward RC\",IMDIV(IMPRODUCT(IMSUM(Rz_2*10^3,IMDIV(1,COMPLEX(0,2*PI()*$C68*Cz_2*10^-12))),RFB_1*10^3),IMSUM(IMSUM(Rz_2*10^3,IMDIV(1,COMPLEX(0,2*PI()*$C68*Cz_2*10^-12))),RFB_1*10^3)),RFB_1*10^3)","v":56874.999999999993},{"$f":"IMPRODUCT(-gm_EA1*10^-6,L68,IMDIV(RFB_2*10^3,IMSUM(M68,RFB_2*10^3)))","v":"-2.41930578879791+4.99627924954149i"},{"$f":"COMPLEX(1,2*PI()*C68*1/(1/(Vreg/Iout_PreReg*Number_Cout*Co*10^-6)+(m_c*(1-Vreg/Vin_nom)-0.5)/(fsw*10^3*L_buck*10^-6*Number_Cout*Co*10^-6)))","v":"1+2.97564543318145i"},{"$f":"COMPLEX(1,2*PI()*C68*(ESR*10^-3*Co*10^-6))","v":"1+0.000616707408486464i"},{"$f":"IMPRODUCT(K,IMDIV(P68,O68))","v":"2.80215006069904-8.32120665667116i"},{"$f":"IMDIV(1,IMSUM(COMPLEX(1,2*PI()*C68/(wn*Qp)),IMPRODUCT(COMPLEX(0,2*PI()*C68/wn),COMPLEX(0,2*PI()*C68/wn))))","v":"0.999949763782094-0.00730878093505871i"},"2.74119141470902-8.34126893166113i",18.870031032787388,-71.807924179484075]
[32.320788403143645,2.1544346900318803,2154.4346900318801,14.183403026919677,116.7268726306668,18.137385376223968,-73.39588238630391,32.320788403143645,43.330990244362894,"-49248.7871113079i","-1086370.30392591i","21382.6235603236-42464.9858346606i",56874.999999999993,"-2.30212919079372+4.57193118518963i","1+3.26576718946169i","1+0.000676835619484316i","2.36806502474447-7.71489336525247i","0.999939490877417-0.00802130087069948i","2.30603825433955-7.73342150586897i",18.137385376223968,-73.39588238630391]
[30.885462828527942,2.3644894126454101,2364.4894126454101,13.492534005322023,117.79192631281612,17.392928823205921,-74.872527424812375,30.885462828527942,42.919398888003741,"-44873.6605996842i","-989860.160287155i","20473.3074920171-38844.3495744394i",56874.999999999993,"-2.20422899353306+4.18212062707983i","1+3.58417545882194i","1+0.000742826256825767i","1.99594605278527-7.13334625721696i","0.999927117388708-0.00880326577429383i","1.9330038400626-7.15039720388831i",17.392928823205921,-74.872527424812375]
[29.456235360406893,2.5950242113997399,2595.0242113997401,12.817865442272957,119.02815729200593,16.638369918133936,-76.243393731140628,29.456235360406893,42.784763560865301,"-40887.2082689993i","-901923.711816158i","19714.2660030557-35524.2939885816i",56874.999999999993,"-2.12250789117011+3.82467165185477i","1+3.93362814136759i","1+0.000815250899842107i","1.67855158415317-6.58032689740451i","0.999912213856905-0.00966143844676127i","1.61482880730477-6.59596645869589i",16.638369918133936,-76.243393731140628]
[28.037441114245276,2.8480358684357996,2848.0358684357998,12.162231878036698,120.42950394400431,15.875209236208576,-77.514637209536147,28.037441114245276,42.914866734468163,"-37254.9013762495i","-821799.295064325i","19081.0970920878-32484.6053644357i",56874.999999999993,"-2.05433867757805+3.49740797942336i","1+4.31715202905967i","1+0.000894736856143814i","1.40899575183935-6.05818713802371i","0.999894263050144-0.0106032384797209i","1.34461036594695-6.07248648176774i",15.875209236208576,-77.514637209536147]
[26.633283985132458,3.1257158496882398,3125.7158496882398,11.528531773328259,121.98768858829314,15.104752211804197,-78.692791833982497,26.633283985132458,43.294896754310642,"-33945.2786167941i","-748792.910664576i","18553.1740123954-29705.4864685435i",56874.999999999993,"-1.99750060395136+3.19819816932356i","1+4.73806902233884i","1+0.000981972595058975i","1.18090324882945-5.568134882368i","0.999872642037853-0.0116368054635312i","1.11595754897737-5.5811676774343i",15.104752211804197,-78.692791833982497]
[25.247791544454721,3.4304692863149198,3430.4692863149198,10.919666154172452,123.69183356721749,14.328125390282271,-79.784576176622878,25.247791544454721,43.907257390594609,"-30929.6736215864i","-682272.212240878i","18113.1091705259-27167.8493497i",56874.999999999993,"-1.95012166022858+2.92498714493967i","1+5.20002490283776i","1+0.00107771371082524i","0.988492229562372-5.11047906772848i","0.999846600609697-0.0127710680916555i","0.923074319302097-5.12231922492715i",14.328125390282271,-79.784576176622878]
[23.884749579557365,3.7649358067924701,3764.93580679247,10.338455310466031,125.52816531873476,13.546294269091334,-80.796744873178127,23.884749579557365,44.731420445556637,"-28181.9666627972i","-621661.029326408i","17746.2765978066-24853.5103345611i",56874.999999999993,"-1.91062716267974+2.67581718742191i","1+5.70702091139759i","1+0.00118278946718564i","0.826603955729814-4.68484470383767i","0.999815235296782-0.0140158196506356i","0.760789290035031-4.69556464186235i",13.546294269091334,-80.796744873178127]
[22.547618077925751,4.1320124001153395,4132.0124001153399,9.7875366708284606,127.4798610803563,12.760081407097291,-81.735978872589598,22.547618077925751,45.743882207766703,"-25678.3584172292i","-566434.376850643i","17440.3923042161-22745.3108689411i",56874.999999999993,"-1.87769457331374+2.44884094588974i","1+6.26344840490192i","1+0.00129810998007443i","0.690695343770076-4.29035470019688i","0.999777458102773-0.0153818004051929i","0.624548255451958-4.30002405444079i",12.760081407097291,-81.735978872589598]
[21.239434330040226,4.5348785081285792,4534.8785081285796,9.2692504214213809,129.5270886620381,11.970183908618846,-82.60880808779774,21.239434330040226,46.918280574240356,"-23397.1638279639i","-516113.907969792i","17185.1492573905-20827.1830407572i",56874.999999999993,"-1.85021420042186+2.2423284918647i","1+6.8741268921093i","1+0.0014246741006059i","0.576807432259488-3.92577903179229i","0.999731958873325-0.0168807874014049i","0.510382582924892-3.93446372519305i",11.970183908618846,-82.60880808779774]
[19.96271253449553,4.9770235643321099,4977.0235643321103,8.7855228109766443,131.64727477351769,11.177189723518886,-83.421560408413711,19.96271253449553,48.225714365103983,"-21318.6242787732i","-470263.770855291i","16971.902323745-19084.1745634376i",56874.999999999993,"-1.82725527822002+2.05467000907291i","1+7.54434577793257i","1+0.0015635780666449i","0.481519693836466-3.58965399393008i","0.999677160017636-0.0185256922140479i","0.414863414980523-3.597415595741i",11.177189723518886,-83.421560408413711]
[18.719351973562908,5.4622772176843402,5462.27721768434,8.3377595199151493,133.81561150188338,10.381592453647757,-84.180331687577151,18.719351973562908,49.63527981430623,"-19424.7364544376i","-428486.83355377i","16793.3978806948-17502.4446638701i",56874.999999999993,"-1.80803685594023+1.88437535072695i","1+8.27991017773375i","1+0.0017160249978948i","0.401897395740476-3.28037535050595i","0.999611162039581-0.0203306671523951i","0.335048903390761-3.28727065822746i",10.381592453647757,-84.180331687577151]
[17.510566609918531,5.9948425031894104,5994.8425031894103,7.9267620778604808,136.00577691403967,9.5838045320580498,-84.890972092114581,17.510566609918531,51.114804821925091,"-17699.0964046424i","-390421.244220052i","16643.5426818468-16069.2396273446i",56874.999999999993,"-1.79190291303622+1.73007140660757i","1+9.08719119845618i","1+0.00188333531674477i","0.33543698974911-2.99626948116358i","0.999531678030067-0.022311220405706i","0.268429468448151-3.00235027094823i",9.5838045320580498,-84.890972092114581]
[16.336847272107867,6.5793322465756798,6579.3322465756801,7.5526785125781206,138.19081098901708,8.7841687595297486,-85.559084992184623,16.336847272107867,52.631725996832458,"-16126.7574608077i","-355737.296929581i","16517.2067357904-14772.8546087299i",56874.999999999993,"-1.77830113641407+1.59049799151933i","1+9.97318112210502i","1+0.00206695818513686i","0.280012790853762-2.73564648253067i","0.999435954908254-0.0244843405469389i","0.212874350919138-2.74095938308821i",8.7841687595297486,-85.559084992184623]
[15.197963502070341,7.2208090183854701,7220.8090183854702,7.2149952450658343,140.3440605714826,7.9829682570045071,-86.190035298257939,15.197963502070341,54.154025273224661,"-14694.1007751955i","-324134.575923431i","16410.0553101159-13602.5866294934i",56874.999999999993,"-1.76676483338818+1.46450278478284i","1+10.9455539695489i","1+0.00226848405651347i","0.233826928559684-2.49683878903283i","0.999320678767072-0.0268686307096653i","0.166581445598192-2.50142524282169i",7.9829682570045071,-86.190035298257939]
[14.093006413946526,7.9248289835391796,7924.8289835391797,6.9125714795313451,142.44009423374365,7.1804349344151817,-86.788964797464459,14.093006413946526,55.651129436279192,"-13388.7173609659i","-295339.353550719i","16318.4056065456-12548.6823567943i",56874.999999999993,"-1.75689750081687+1.35103570794645i","1+12.0127319692176i","1+0.00248965845156422i","0.195363646363946-2.27822838892494i","0.999181861166971-0.0294844525939285i","0.128031494846894-2.28212467197925i",7.1804349344151817,-86.788964797464459]
[13.020467876559817,8.6974900261778298,8697.4900261778293,6.6437112809354257,144.45549350129878,6.376756595624391,-87.360812587308047,13.020467876559817,57.094680913990729,"-12199.300611469i","-269102.21937064i","16239.1041135693-11602.2832271427i",56874.999999999993,"-1.74835962045157+1.24914301660452i","1+13.1839585064152i","1+0.00273239707709108i","0.163348403147103-2.07826520621269i","0.999014702618806-0.032354080222285i","0.0959470971882709-2.08150248428719i",6.376756595624391,-87.360812587308047]
[11.978346398290263,9.5454845666183505,9545.4845666183501,6.4062635952979807,146.36944921916546,5.5720828029922833,-87.910339154218619,11.978346398290263,58.459110064946842,"-11115.5483678275i","-245195.919878547i","16169.4210951713-10755.3696678531i",56874.999999999993,"-1.74085729921844+1.15796129508101i","1+14.4693781851024i","1+0.0029988024189443i","0.136711822997849-1.89547874644826i","0.998813428789325-0.0355018630317567i","0.0692565778485089-1.89808315035217i",5.5720828029922833,-87.910339154218619]
[10.964267292151803,10.476157527896699,10476.157527896699,6.1977376733556504,148.16412467899789,4.7665296187961523,-88.442153005544242,10.964267292151803,59.721971673453652,"-10128.0736865647i","-223413.390144809i","16106.9590992906-10000.7055302455i",56874.999999999993,"-1.73413241891428+1.07671147391054i","1+15.8801246956021i","1+0.00329118195274897i","0.114558288041747-1.72848468669403i","0.998571094137965-0.0389543974172071i","0.0470625156173835-1.73047739387259i",4.7665296187961523,-88.442153005544242]
[9.9756043691453797,11.497569953977399,11497.5699539774,6.0154210410871549,149.82478209427282,3.9601833280582239,-88.960739047171941,9.9756043691453797,60.864043047100878,"-9228.32353439107i","-203565.960317449i","16049.5727597772-9331.7833342067i",56874.999999999993,"-1.72795400180031+1.00469293467347i","1+17.4284172492991i","1+0.00361206813015501i","0.0961388257089772-1.57598773477708i","0.998279346739512-0.0427407051928583i","0.0286145769653938-1.57738504754996i",3.9601833280582239,-88.960739047171941]
[9.0095921912827368,12.6185688306602,12618.568830660201,5.856488960410406,151.33969851604564,3.1531032308723308,-89.470488116048074,9.0095921912827368,61.86921039999757,"-8408.50470592118i","-185481.721454144i","15995.2975209942-8742.77049722259i",56874.999999999993,"-1.72211053683975+0.94127772082247i","1+19.1276664156036i","1+0.00396424031372192i","0.0808278725665315-1.43678178913639i","0.997928146954564-0.0468924165544274i","0.0132862389385993-1.43759520268054i",3.1531032308723308,-89.470488116048074]
[8.0634210050895128,13.8488637139387,13848.863713938699,5.718097431388232,152.69991668070693,2.3453235737012816,-89.975727237480029,8.0634210050895128,62.724189443226905,"-7661.51632265725i","-169004.036529204i","15942.2852413092-8228.45635194716i",56874.999999999993,"-1.71640304654095+0.885904833405901i","1+20.9925902778879i","1+0.00435074885042761i","0.0681034758212225-1.30974819245254i","0.997505431375151-0.051443953931506i","0.000554961352793995-1.30998444777792i",2.3453235737012816,-89.975727237480029]
[7.134309959610345,15.1991108295293,15199.1108295293,5.5974552902219319,153.89888448438549,1.5368546693884135,-90.480750289548581,7.134309959610345,63.41813419483691,"-6980.88832857618i","-153990.183718592i","15888.7449423356-7784.19942012076i",56874.999999999993,"-1.71063870781034+0.838074554390572i","1+23.0393419144835i","1+0.00477494149231463i","0.0575305027360419-1.19385268236131i","0.996996712102368-0.0564327115248554i","-0.0100146219534406-1.1935138013136i",1.5368546693884135,-90.480750289548581]
[6.2195573525299102,16.681005372000598,16681.0053720006,5.4918741171517116,154.93203552590734,0.72768323537819823,-90.989848827531418,6.2195573525299102,63.94218669837592,"-6360.7254495999i","-140310.120211763i","15832.8872820848-7405.87408799045i",56874.999999999993,"-1.70462487373474+0.797342705548131i","1+25.2856493089181i","1+0.0052404923931169i","0.0487464549431995-1.08814149306952i","0.996384599929346-0.0618992232079744i","-0.018784896154815-1.08722479393372i",0.72768323537819823,-90.989848827531418]
[5.316569016241683,18.3073828029537,18307.3828029537,5.3987970570601318,155.79635565498322,-8.2228040818448936E-2,-91.507342854086744,5.316569016241683,64.289012800896472,"-5795.65613155139i","-127845.355843045i","15772.8716651141-7089.81550586191i",56874.999999999993,"-1.6981633792721+0.763314716145133i","1+27.750968901228i","1+0.00575143393202155i","0.0414495205274438-0.991736945279641i","0.995648238453957-0.0678873086887168i","-0.0260572100442935-0.990235038972429i",-8.2228040818448936E-2,-91.507342854086744]
[4.4228674301245716,20.092330025650497,20092.330025650499,5.3158091504927434,156.48997006936349,-0.89294172036817154,-92.037611318074539,4.4228674301245716,64.452358751288955,"-5280.78601432198i","-116487.926786514i","15706.7552908036-6832.76120585872i",56874.999999999993,"-1.69104505560802+0.735639337303668i","1+30.4566541103339i","1+0.00631219164020852i","0.0353885362692153-0.90383277201721i","0.994762634618814-0.0744441841928848i","-0.0320818997851468-0.901733540259008i",-0.89294172036817154,-92.037611318074539]
[3.5360848219995615,22.051307399030499,22051.307399030498,5.2406324699446198,157.01177491245039,-1.7045476479450581,-92.585122086140558,3.5360848219995615,64.426652826309834,"-4811.65553926576i","-106139.46042498i","15632.4439187472-6631.78760126293i",56874.999999999993,"-1.68304442938288+0.714001805294851i","1+33.4261402871405i","1+0.00692762253268445i","0.0303545721078485-0.823689359242772i","0.993697869816005-0.0816205192279893i","-0.0370666795412195-0.820975917606039i",-1.7045476479450581,-92.585122086140558]
[2.6539436082889694,24.201282647943803,24201.282647943801,5.1711094629682117,157.36112822858456,-2.5171658546792424,-93.154461054245701,2.6539436082889694,64.206667174338861,"-4384.20132263575i","-96710.323293436i","15547.6447417836-6484.23921651619i",56874.999999999993,"-1.67391464883502+0.698116222189407i","1+36.6851477003343i","1+0.00760305717742304i","0.0261738876468393-0.750629027978096i","0.992418174730118-0.0894704149544252i","-0.0411836488059697-0.747279678434198i",-2.5171658546792424,-93.154461054245701]
[1.7742272507376509,26.560877829466801,26560.877829466801,5.1051776515500666,157.53760830578099,-3.3309504008124158,-93.750359946727087,1.7742272507376509,63.787248359053905,"-3994.72096049797i","-88118.8447168666i","15449.8225516933-6387.64823901054i",56874.999999999993,"-1.66338276444399+0.687716894517771i","1+40.2619043130472i","1+0.00834434586619489i","0.0227020452555932-0.684031445402879i","0.990880850874597-0.0980512720436567i","-0.0445751314201576-0.680019625061089i",-3.3309504008124158,-93.750359946727087]
[0.89474418161989355,29.150530628251801,29150.530628251799,5.040838429563669,157.54084295780444,-4.1460942479437755,-94.377722181632578,0.89474418161989355,63.163120776171866,"-3639.84096027964i","-80290.6094179329i","15336.1614096253-6339.64185233377i",56874.999999999993,"-1.65114560223256+0.682548356438179i","1+44.1873902799691i","1+0.00915790928699601i","0.0198189955204871-0.623329223046399i","0.98903502281966-0.107423506333666i","-0.0473585300530163-0.618623458330678i",-4.1460942479437755,-94.377722181632578]
[1.328702372380075E-2,31.992671377973799,31992.671377973798,4.9761222904058187,157.37041083312695,-4.9628352666820179,-95.041645954400963,1.328702372380075E-2,62.328764878725991,"-3316.48752119045i","-73157.8129674362i","15203.5353320427-6337.83491645726i",56874.999999999993,"-1.63686660771151+0.682353815304558i","1+48.4956062826258i","1+0.0100507941369755i","0.0174249783465747-0.568003738489269i","0.986820208158109-0.117650058815305i","-0.0496303524814582-0.562567617177894i",-4.9628352666820179,-95.041645954400963]
[0.87241098976946585,{"$f":"C99/1000","v":35.111917342151294},35111.917342151297,4.9090525075354821,157.02581484324054,-5.7814634973049479,-95.747443397242435,-0.87241098976946585,61.278371445998104,"-3021.85991043051i","-66658.6744947908i","15048.4930826753-6379.70606472385i",56874.999999999993,"-1.62017420852729+0.686861811828213i","1+53.2238680270191i","1+0.0110307341575555i","0.0154371070283472-0.517581201091374i","0.984164698350923-0.128795632297428i","-0.0514695422778615-0.51137337860476i",-5.7814634973049479,-95.747443397242435]
[1.7647206453421571,38.5352859371054,38535.2859371054,4.8376091406122672,156.5065276535496,-6.6023297859544243,-96.50065429769549,-1.7647206453421571,60.005873355854106,{"$f":"IMDIV(1,COMPLEX(0,2*PI()*$C100*Cz*10^-9))","v":"-2753.40620458276i"},{"$f":"IMDIV(1,COMPLEX(0,2*PI()*$C100*Cp_Cstray*10^-12))","v":"-60736.9015716785i"},{"$f":"IMDIV(IMPRODUCT(IMDIV(IMPRODUCT(K100,IMSUM(Rz*10^3,J100)),IMSUM(K100,IMSUM(Rz*10^3,J100))),Ro_EA*10^3),IMSUM(IMDIV(IMPRODUCT(K100,IMSUM(Rz*10^3,J100)),IMSUM(K100,IMSUM(Rz*10^3,J100))),Ro_EA*10^3))","v":"14867.2639696437-6462.45640697862i"},{"$f":"IF($E$1=\"Feedforward RC\",IMDIV(IMPRODUCT(IMSUM(Rz_2*10^3,IMDIV(1,COMPLEX(0,2*PI()*$C100*Cz_2*10^-12))),RFB_1*10^3),IMSUM(IMSUM(Rz_2*10^3,IMDIV(1,COMPLEX(0,2*PI()*$C100*Cz_2*10^-12))),RFB_1*10^3)),RFB_1*10^3)","v":56874.999999999993},{"$f":"IMPRODUCT(-gm_EA1*10^-6,L100,IMDIV(RFB_2*10^3,IMSUM(M100,RFB_2*10^3)))","v":"-1.60066243860089+0.695771007555082i"},{"$f":"COMPLEX(1,2*PI()*C100*1/(1/(Vreg/Iout_PreReg*Number_Cout*Co*10^-6)+(m_c*(1-Vreg/Vin_nom)-0.5)/(fsw*10^3*L_buck*10^-6*Number_Cout*Co*10^-6)))","v":"1+58.413129454419i"},{"$f":"COMPLEX(1,2*PI()*C100*(ESR*10^-3*Co*10^-6))","v":"1+0.0121062171203992i"},{"$f":"IMPRODUCT(K,IMDIV(P100,O100))","v":"0.0137865233432371-0.471628970766508i"},{"$f":"IMDIV(1,IMSUM(COMPLEX(1,2*PI()*C100/(wn*Qp)),IMPRODUCT(COMPLEX(0,2*PI()*C100/wn),COMPLEX(0,2*PI()*C100/wn))))","v":"0.980983754159823-0.14092557049512i"},"-0.0529402263412357-0.464603231980352i",-6.6023297859544243,-96.50065429769549]
[{"$f":"ABS(H101)","v":2.6661606392913892},42.292428743894995,42292.428743894998,{"$f":"20*LOG(IMABS(N101))","v":4.7596952737249083},{"$f":"IF(180/PI()*IMARGUMENT(N101)>0,180/PI()*IMARGUMENT(N101),360+180/PI()*IMARGUMENT(N101))","v":155.81210923409293},{"$f":"T101","v":-7.4258559130162975},-97.307052396242099,{"$f":"D101+F101","v":-2.6661606392913892},58.50505683785083,"-2508.80118607312i","-55341.2026339659i","14655.7934259114-6582.85202602881i",56874.999999999993,"-1.57789476884579+0.708733227475252i","1+64.1083374648108i","1+0.013286558344429i","0.0124160294883785-0.42975213064628i","0.97717763628811-0.154104276624526i",{"$f":"IMPRODUCT(Q101,R101)","v":"-0.0540939748735566-0.421857534457566i"},{"$f":"20*LOG(IMABS(S101))","v":-7.4258559130162975},{"$f":"180/PI()*IMARGUMENT(S101)","v":-97.307052396242099}]
[3.579438703704831,46.4158883361278,46415.888336127799,4.6731076043617605,154.94239608017719,-8.2525463080665915,-98.172641722047658,-3.579438703704831,56.769754358129532,"-2285.9262032482i","-50424.8427187101i","14409.8187775424-6737.05460578615i",56874.999999999993,"-1.55141226464756+0.725335224847257i","1+70.3588212254421i","1+0.0145819813806623i","0.0112781178139986-0.391590308784263i","0.972629517498225-0.168393048867306i","-0.0549716557153542-0.382771449734003i",-8.2525463080665915,-98.172641722047658]
[4.5074875436524282,50.941380148163901,50941.380148163902,4.5755138558990547,153.89776024559981,-9.0830013995514829,-99.103639767536066,-4.5074875436524282,54.794120478063746,"-2082.85081962824i","-45945.2386682701i","14124.9964317294-6920.44904209835i",56874.999999999993,"-1.52074727937872+0.745080121167973i","1+77.2187194364695i","1+0.0160037065637197i","0.0103333321351823-0.35681474020966i","0.96720335971775-0.183847191310275i","-0.0556049542474237-0.347012169617529i",-9.0830013995514829,-99.103639767536066]
[5.4534926588802897,55.908101825122195,55908.101825122198,4.4644399084646587,152.67943317912517,-9.9179325673449483,-100.1064435598514,-5.4534926588802897,52.57298961927377,"-1897.81609338988i","-41863.590295365i","13797.09094197-7127.48276420224i",56874.999999999993,"-1.48544380982705+0.767370106949625i","1+84.7474492544797i","1+0.0175640481969954i","0.00954890523727113-0.325125558165255i","0.960741891646839-0.200512244746053i","-0.0560176222112164-0.314276416198414i",-9.9179325673449483,-100.1064435598514]
[6.4209086278001406,61.3590727341318,61359.072734131798,4.3372699124601199,151.28988403157902,-10.758178540260261,-101.18757389642401,-6.4209086278001406,50.102310135155008,"-1729.21934225345i","-38144.5443144143i","13422.2330095343-7351.53833028894i",56874.999999999993,"-1.44508527354986+0.791492724905876i","1+93.010220935477i","1+0.019276521213263i","0.00889762631097391-0.296249301891085i","0.953064892144458-0.218419177825171i","-0.0562265136899216-0.284288221178136i",-10.758178540260261,-101.18757389642401]
[7.4134601013724479,67.341506577508312,67341.506577508306,4.1912627929212052,149.73323439643951,-11.604722894293653,-102.35359224466475,-7.4134601013724479,47.37964215177476,"-1575.60026181586i","-34755.8881282911i","12997.2463967657-7584.86760199565i",56874.999999999993,"-1.39932970552094+0.816613782943832i","1+102.078602654922i","1+0.0211559582345569i","0.0083568997130328-0.269936627567462i","0.943968074141168-0.237578394200549i","-0.0562424639854868-0.256796977279336i",-11.604722894293653,-102.35359224466475]
[8.4351237925533304,73.907220335257705,73907.220335257705,4.0235882535147223,148.01568166485629,-12.458712046068053,-103.61098418600336,-8.4351237925533304,44.404697478852924,"-1435.62827709243i","-31668.2708182155i","12520.0322406622-7818.62056368257i",56874.999999999993,"-1.3479511346956+0.84178045694975i","1+112.031140397033i","1+0.0232186380452488i","0.00790796286800023-0.245960208801404i","0.93322297231446-0.257972457758066i","-0.0560710669625577-0.231575753745649i",-12.458712046068053,-103.61098418600336]
[9.4900883714771265,81.1130830789687,81113.083078968702,3.8313844155852306,146.1458924056914,-13.321472787062357,-104.96600300580063,-9.4900883714771265,41.179889399890769,"-1308.09101771287i","-28854.9489201369i","11989.9835936947-8043.0019461711i",56874.999999999993,"-1.29088421494732+0.865938153456927i","1+122.954038282523i","1+0.0254824265910907i","0.00753523649816787-0.224112813174679i","0.920578359510409-0.27954753166393i","-0.0557134080832347-0.208419862661176i",-13.321472787062357,-104.96600300580063]
[10.58269056031345,89.021508544503902,89021.5085445039,3.6118374021739634,144.13531749411251,-14.194527962487413,-106.42446737291546,-10.58269056031345,37.710850121197055,"-1191.88381694917i","-26291.5547856435i","11408.3850648469-8247.58122052462i",56874.999999999993,"-1.22826725184146+0.887963884677044i","1+134.941905227456i","1+0.0279669317254894i","0.00722578485699123-0.20420554175426i","0.905763837689805-0.302203686206274i","-0.0551668128394973-0.18714565399638i",-14.194527962487413,-106.42446737291546]
[11.717327902572283,97.700995729922511,97700.995729922506,3.3622804713843624,141.99837510954521,-15.079608373956646,-107.99150838745803,-11.717327902572283,34.006866722087182,"-1086.00014362086i","-23955.8855210484i","10778.7362067724-8421.76395302587i",56874.999999999993,"-1.16047701964503+0.90671701625101i","1+148.098574400413i","1+0.0306936730433532i","0.00696886738750246-0.186066219012283i","0.888496342318439-0.325784472989467i","-0.0544256719181612-0.167589503810606i",-15.079608373956646,-107.99150838745803]
[12.898351467369352,107.226722201033,107226.722201033,3.0803069458945282,139.75244963785474,-15.978658413263879,-109.67126404763256,-12.898351467369352,30.081185590222177,"-989.52288400339i","-21827.7106765455i","10106.9287050498-8555.40495552163i",56874.999999999993,"-1.08814783815116+0.92110528119261i","1+162.538002575736i","1+0.0336862682735279i","0.0067555663510282-0.169537921250081i","0.868490321788689-0.350066499381804i","-0.0534824026104145-0.149606941245714i",-15.978658413263879,-109.67126404763256]
[14.129944666160453,117.6811952435,117681.1952435,2.7638877240832205,137.41766677496796,-16.893832390243674,-111.46652385380317,-14.129944666160453,25.951142921164788,"-901.616398227882i","-19888.5970197327i","9401.21281911551-8639.50992412788i",56874.999999999993,"-1.01216795959075+0.930160320803302i","1+178.385257172577i","1+0.0369706378442646i","0.0065784775744528-0.154477632324447i","0.845472245717179-0.374750159455257i","-0.0523285971375844-0.133071836234422i",-16.893832390243674,-111.46652385380317]
[15.415996705865886,129.15496650148799,129154.966501488,2.411481419828541,135.01642857880776,-17.827478125694427,-113.37833317334322,-15.415996705865886,21.63809540546454,"-821.519282368244i","-18121.7488757701i","8671.91200804721-8666.9403903593i",56874.999999999993,"-0.933648844230878+0.933113582214385i","1+195.777599529063i","1+0.040575229393571i","0.00643145363177304-0.140755016201223i","0.819199786127094-0.399453145143565i","-0.0509563884766772-0.117875543549414i",-17.827478125694427,-113.37833317334322]
[16.759980243316125,141.74741629268101,141747.41629268101,2.022124075856726,132.572724479019,-18.782104319172852,-115.40557615856176,-16.759980243316125,17.167148320457244,"-748.537773524664i","-16511.8626512793i","7930.88509481778-8633.01752230747i",56874.999999999993,"-0.853867255068233+0.929461325766188i","1+214.865673794342i","1+0.0445312641690421i","0.00630939057970143-0.128251296589039i","0.789485436614449-0.42370878432308i","-0.0493600289890138-0.103925875096311i",-18.782104319172852,-115.40557615856176]
[18.164842077444376,155.56761439304699,155567.614393047,1.5954866115732709,130.11126944497929,-19.760328689017648,-117.54456687950429,-18.164842077444376,12.566702565474998,"-682.039740781286i","-15044.9942819401i","7190.78462437182-8535.92313148247i",56874.999999999993,"-0.774185410025827+0.919007798828768i","1+235.814811736123i","1+0.0488730074513686i","0.00620805086789459-0.116858234618231i","0.756223455592955-0.446971483689803i","-0.0475376248288657-0.0911457597047356i",-19.760328689017648,-117.54456687950429]
[19.632913309520688,170.73526474706901,170735.26474706901,1.1318918226538282,127.65655043203741,-20.764805132174516,-119.78868948272432,-19.632913309520688,7.8678609493130836,"-621.449209990571i","-13708.4384556743i","6464.2047202471-8376.82476575616i",56874.999999999993,"-0.69595923717053+0.90187870375244i","1+258.806464765373i","1+0.05363806534381i","0.00612391629252926-0.106477196216375i","0.719417890097494-0.468631399568272i","-0.0454929025466803-0.0794714593084883i",-20.764805132174516,-119.78868948272432]
[21.165842056140566,187.38174228603899,187381.74228603899,0.63228823986112348,125.23187892723196,-21.798130296001688,-122.12813719946868,-21.165842056140566,3.1037417277632784,"-566.241374960799i","-12490.6185653118i","5762.83748745474-8159.70065482923i",56874.999999999993,"-0.620447550051202+0.878502350875073i","1+284.03977558162i","1+0.0588677104982676i","0.00605406589965946-0.0970183014856077i","0.67920823182595-0.48803972315351i","-0.0432368136027943-0.0688502536524195i",-21.798130296001688,-122.12813719946868]
[22.764548674758736,205.651230834865,205651.23083486501,9.818426307579553E-2,122.85854616042015,-22.862732937834529,-124.54980367665456,-22.764548674758736,-1.6912575162344154,"-515.938051835909i","-11380.9864375567i","5096.75499867998-7890.8961925965i",56874.999999999993,"-0.548734743783116+0.849561907838428i","1+311.733303051752i","1+0.0646072395992511i","0.00599607460732752-0.0883996490038135i","0.635888297910709-0.504544535667353i","-0.0407887261835869-0.0592375890195199i",-22.862732937834529,-124.54980367665456]
[24.429201646870176,225.701971963392,225701.97196339199,-0.46844871717815317,120.55515871232623,-23.960752929692024,-127.03737504238052,-24.429201646870176,-6.4822163300542854,"-470.103537295661i","-10369.9309697573i","4473.90484278733-7578.49036573242i",56874.999999999993,"-0.481676484008506+0.815927187039603i","1+342.12691526237i","1+0.0709063657020922i","0.0059479290322014-0.0805466085502698i","0.589913638919663-0.517535144336243i","-0.0381769362224369-0.0505938052627094i",-23.960752929692024,-127.03737504238052]
[26.159212248594514,247.707635599171,247707.63559917099,-1.0652921641411996,118.33720117716969,-25.093920084453316,-129.57165506830847,-26.159212248594514,-11.234453891138784,"-428.340834701956i","-9448.69488313135i","3899.86102997375-7231.57561701027i",56874.999999999993,"-0.419872888460726+0.77857711315849i","1+375.483867142399i","1+0.0778196488236453i","0.00590795760209109-0.0733911762955415i","0.541893552716463-0.526490511262357i","-0.03543827379569-0.0428806888792725i",-25.093920084453316,-129.57165506830847]
[27.953247539835296,271.85882427329403,271858.82427329401,-1.6898022918844209,116.2168373948589,-26.263445247950873,-132.13112895915799,-27.953247539835296,-15.914291564299091,"-390.288215503843i","-8609.29887140833i","3377.82325814574-6859.55400212119i",56874.999999999993,"-0.363668447979803+0.738523944901273i","1+412.093080651341i","1+0.0854069685150539i","0.00587477253049339-0.0668713869961007i","0.492565797002018-0.531025459742419i","-0.0326166970095296-0.0360582118162521i",-26.263445247950873,-132.13112895915799]
[29.809262934400145,298.36472402833402,298364.72402833402,-2.3393264874674795,114.20293057292345,-27.469936446932664,-134.69273735181335,-29.809262934400145,-20.4898067788899,"-355.616086117878i","-7844.47248789439i","2908.81914598471-6471.53082834201i",56874.999999999993,"-0.313173799642466+0.696747991985981i","1+452.271647283078i","1+0.093734042509776i","0.0058472216403313-0.0609307781973189i","0.442755107445785-0.530927513708062i","-0.0297609393309757-0.0300818640951103i",-27.469936446932664,-134.69273735181335]
[31.724556422602355,327.45491628777302,327454.916287773,-3.0112056330991654,112.30124081508937,-28.713350789503188,-137.23279797915703,-31.724556422602355,-24.931557164067655,"-324.024133146168i","-7147.59117234195i","2492.04313579495-6075.85422370356i",56874.999999999993,"-0.268302214246335+0.654148043523973i","1+496.367574560689i","1+0.102872995939153i","0.0058243483654477-0.0555179018758544i","0.393319946621684-0.526178029309595i","-0.0269214678122366-0.0249009423473028i",-28.713350789503188,-137.23279797915703]
[33.695845616770256,359.38136638046302,359381.36638046301,-3.7028572032452205,110.51474805600003,-29.992988413525033,-139.72798660962633,-33.695845616770256,-29.213238553626297,"-295.238722205396i","-6512.61887217782i","2125.26264103979-5679.81580488003i",56874.999999999993,"-0.22881332359606+0.611509140861851i","1+544.762800311139i","1+0.112902986045792i","0.0058053585419506-0.0505858793458372i","0.34509455895042-0.516953753874551i","-0.0241471625752922-0.0204580136128199i",-29.992988413525033,-139.72798660962633]
[35.719366234838546,394.42060594376602,394420.60594376602,-4.4118373115327945,108.84404798346198,-31.30752892330575,-142.15627844511809,-35.719366234838546,-33.312230461656114,"-269.010527836683i","-5934.05576110332i","1805.23205671608-5289.50130066978i",56874.999999999993,"-0.194357694330554+0.569486495174915i","1+597.876500828015i","1+0.123910887805737i","0.00578959283698381-0.0460919956147797i","0.298834513958826-0.503608523453775i","-0.0214821916931375-0.016689567406967i",-31.30752892330575,-142.15627844511809]
[37.790987271203974,432.87612810830598,432876.12810830597,-5.1358824762847171,107.28777522985268,-32.655104794919254,-144.49775920287104,-37.790987271203974,-37.209983973018353,"-245.112373967755i","-5406.89060222989i","1528.07204320698-4909.76385614264i",56874.999999999993,"-0.164517662969574+0.528602613296853i","1+656.168721576054i","1+0.135992046397945i","0.00577650385804117-0.0419973297068071i","0.255173098914055-0.486638471214943i","-0.0189635079332852-0.0135276577738456i",-32.655104794919254,-144.49775920287104]
[39.906335125399934,475.08101621027902,475081.01621027902,-5.8729335709718846,105.84301852279995,-34.033401554428046,-146.73523935402596,-39.906335125399934,-40.892220831226012,"-223.33726622247i","-4926.55734314274i","1289.5893311186-4544.28637185931i",56874.999999999993,"-0.13884176723819+0.489254009381489i","1+720.144361884875i","1+0.149251103038619i","0.00576563714832763-0.0382664177747721i","0.214593459161867-0.466636815215801i","-0.0166192513002052-0.010902181516607i",-34.033401554428046,-146.73523935402596]
[42.060917372298775,521.40082879996999,521400.82879996998,-6.6211452772881421,104.50570372197605,-35.439772095010632,-148.85463877840968,-42.060917372298775,-44.348935056433632,"-203.496599034564i","-4488.89556693891i","1085.52745975297-4195.7001449867i",56874.999999999993,"-0.116871741461254+0.451723978226606i","1+790.357548145439i","1+0.163802901333362i","0.00575661540850457-0.0348669461010855i","0.17741810253418-0.444245366362337i","-0.0144681514618167-0.0087433771395743i",-35.439772095010632,-148.85463877840968]
[44.250237094304254,572.23676593502205,572236.76593502203,-7.3788845480174956,103.27093080832528,-36.871352546286758,-150.84514395457262,-44.250237094304254,-47.574213146247345,"-185.418522036463i","-4090.11445668667i","911.749740578269-3865.73225097306i",56874.999999999993,"-0.0981622150603894+0.416198462908502i","1+867.416433387735i","1+0.179773481997545i","0.00574912539712048-0.031769471341646i","0.143814267734539-0.420109293584919i","-0.0125198439038043-0.00698416426662764i",-36.871352546286758,-150.84514395457262]
[46.469890552475405,628.02914418342607,628029.14418342605,-8.1447213378199059,102.13325896480772,-38.325169214655503,-152.69916839454515,-46.469890552475405,-50.565909429737431,"-168.946451573604i","-3726.75996118244i","764.362273605413-3555.36094373829i",56874.999999999993,"-0.082293956933966+0.382782785718366i","1+951.98846481143i","1+0.197301174560694i","0.00574290705499062-0.0289471655999374i","0.113811461215491-0.394839878667953i","-0.0107758867097072-0.0055620479397695i",-38.325169214655503,-152.69916839454515]
[48.715643817541114,689.26121043497108,689261.21043497103,-8.9174143743251548,101.08693965624866,-39.798229443215959,-154.41216509378506,-48.715643817541114,-53.325225437536403,"-153.937714451737i","-3395.68487761184i","639.787836531213-3264.96509339421i",56874.999999999993,"-0.068881830624669+0.351517737157956i","1+1044.80616489418i","1+0.216537795510691i","0.0057377444759776-0.0263755841309538i","0.0873265026564656-0.368987706544173i","-0.00923120913901995-0.00442044469260504i",-39.798229443215959,-154.41216509378506]
[50.983487067105486,756.4633275546289,756463.32755462895,-9.69589417196676,100.12610129186625,-41.287592895138729,-155.98234653260113,-50.983487067105486,-55.856245240734879,"-140.262312169964i","-3094.02159198449i",{"$f":"IMDIV(IMPRODUCT(IMDIV(IMPRODUCT(K132,IMSUM(Rz*10^3,J132)),IMSUM(K132,IMSUM(Rz*10^3,J132))),Ro_EA*10^3),IMSUM(IMDIV(IMPRODUCT(K132,IMSUM(Rz*10^3,J132)),IMSUM(K132,IMSUM(Rz*10^3,J132))),Ro_EA*10^3))","v":"534.801988408961-2994.45937367154i"},56874.999999999993,{"$f":"IMPRODUCT(-gm_EA1*10^-6,L132,IMDIV(RFB_2*10^3,IMSUM(M132,RFB_2*10^3)))","v":"-0.0575786813688901+0.322394130698095i"},"1+1146.67347615089i","1+0.237649963255571i",{"$f":"IMPRODUCT(K,IMDIV(P132,O132))","v":"0.00573345841071462-0.0240324536687414i"},"0.0641915662271709-0.343026623862612i","-0.00787573176984089-0.00350940972296256i",-41.287592895138729,-155.98234653260113]
[53.2696679800829,830.21756813197499,830217.56813197501,-10.479244935768593,99.244891057184859,-42.790423044314309,-157.41036510789004,-53.2696679800829,-58.165474050705186,"-127.801794935915i","-2819.15724123342i","446.541780423959-2743.41122152402i",56874.999999999993,"-0.0480762739297571+0.295365395065016i","1+1258.47272449923i","1+0.26082054129246i","0.00572990004302224-0.0218974795485569i","0.0441815868501483-0.317347263178281i","-0.00669594912884346-0.00278583349141214i",-42.790423044314309,-157.41036510789004]
[55.570707686648191,911.16275611549099,911162.75611549104,-11.266686515709978,98.437580294511079,-44.304021170938213,-158.69899790351727,-55.570707686648191,-60.261417609006187,"-116.448235710315i","-2568.71108184519i","372.495814851825-2511.13856105237i",56874.999999999993,"-0.0401042223092806+0.270358095545078i","1+1381.17226154459i","1+0.286250222083705i","0.00572694582295191-0.0199521699563679i","0.0270385873485534-0.292258091199042i","-0.00567633458185264-0.00221322474477469i",-44.304021170938213,-158.69899790351727]
[57.883403979156995,1000,1000000,-12.057557175863225,97.698639806102904,-45.825846803293771,-159.85286751290329,-57.883403979156995,-62.154227706800384,"-106.103295394597i","-2340.51386899846i","310.482553031295-2296.7891376034i",56874.999999999993,"-0.0334276543076684+0.247280475375619i","1+1515.83485197844i","1+0.314159265358979i","0.00572449317706821-0.0181796757859454i","0.0124916322872906-0.267991706369622i","-0.00480049407132297-0.00176121051964396i",-45.825846803293771,-159.85286751290329]
[]
[{"$f":"ABS(H137)","v":0.84192182331567977},35,{"$f":"fc*1000","v":35000},{"$f":"20*LOG(IMABS(N137))","v":4.9114148157640161},{"$f":"IF(180/PI()*IMARGUMENT(N137)>0,180/PI()*IMARGUMENT(N137),360+180/PI()*IMARGUMENT(N137))","v":157.04053150983901},{"$f":"T137","v":-5.7533366390796958},{"$f":"U137","v":-95.722470020933102},{"$f":"D137+F137","v":-0.84192182331567977},{"$f":"E137+G137","v":61.318061488905911},"-3031.52272555991i","-66871.8248285275i",{"$f":"IMDIV(IMPRODUCT(IMDIV(IMPRODUCT(K137,IMSUM(Rz*10^3,J137)),IMSUM(K137,IMSUM(Rz*10^3,J137))),Ro_EA*10^3),IMSUM(IMDIV(IMPRODUCT(K137,IMSUM(Rz*10^3,J137)),IMSUM(K137,IMSUM(Rz*10^3,J137))),Ro_EA*10^3))","v":"15054.2249937871-6377.57486255491i"},{"$f":"IF($E$1=\"Feedforward RC\",IMDIV(IMPRODUCT(IMSUM(Rz_2*10^3,IMDIV(1,COMPLEX(0,2*PI()*$C137*Cz_2*10^-12))),RFB_1*10^3),IMSUM(IMSUM(Rz_2*10^3,IMDIV(1,COMPLEX(0,2*PI()*$C137*Cz_2*10^-12))),RFB_1*10^3)),RFB_1*10^3)","v":56874.999999999993},{"$f":"IMPRODUCT(-gm_EA1*10^-6,L137,IMDIV(RFB_2*10^3,IMSUM(M137,RFB_2*10^3)))","v":"-1.6207913264339+0.68663235903395i"},{"$f":"COMPLEX(1,2*PI()*C137*1/(1/(Vreg/Iout_PreReg*Number_Cout*Co*10^-6)+(m_c*(1-Vreg/Vin_nom)-0.5)/(fsw*10^3*L_buck*10^-6*Number_Cout*Co*10^-6)))","v":"1+53.0542198192454i"},{"$f":"COMPLEX(1,2*PI()*C137*(ESR*10^-3*Co*10^-6))","v":"1+0.0109955742875643i"},{"$f":"IMPRODUCT(K,IMDIV(P137,O137))","v":"0.0154993758917437-0.519235064904244i"},{"$f":"IMDIV(1,IMSUM(COMPLEX(1,2*PI()*C137/(wn*Qp)),IMPRODUCT(COMPLEX(0,2*PI()*C137/wn),COMPLEX(0,2*PI()*C137/wn))))","v":"0.98426400671493-0.128397224533482i"},{"$f":"IMPRODUCT(Q137,R137)","v":"-0.0514128633973789-0.513054462256039i"},{"$f":"20*LOG(IMABS(S137))","v":-5.7533366390796958},{"$f":"180/PI()*IMARGUMENT(S137)","v":-95.722470020933102}]
[null,null,null,{"$f":"20*LOG(IMABS((-gm_EA1*10^-6*Rz*10^3)))","v":22.348077688326864}]

{"sheet":"Constants","index":2,"n_rows":51,"n_cols":7,"rows_kept":51,"cut":false,"hidden":false,"merged":[[31,3,31,4],[33,3,33,4],[16,0,17,1],[35,0,35,1],[32,3,32,4],[34,3,34,4],[31,0,31,1],[32,0,32,1],[33,0,33,1],[34,0,34,1],[49,0,49,1],[50,0,50,1],[1,0,1,1],[18,0,19,1],[20,0,21,1],[22,0,23,1],[42,0,42,1],[43,0,43,1],[44,0,44,1],[45,0,45,1],[47,0,47,1],[48,0,48,1],[40,0,40,1],[41,0,41,1],[4,0,4,1],[24,0,24,2],[0,0,0,6],[10,1,11,1],[12,1,13,1],[14,1,15,1],[10,0,15,0],[5,0,5,1],[6,0,6,1],[7,0,7,1],[8,0,8,1],[2,0,2,1],[3,0,3,1]]}
["These values are all derived from the data sheet or lab measurements."]
["PARAMETER",null,"MIN","TYP","MAX","UNITS","COMMENTS"]
["dead time",null,"-",15,"-","ns"]
["Icc",null,"-",0.02,"-","A"]
["Rds_On at 25°C",null,"-",{"$f":"Rds_ON_150/Rds_on_coeff_150","v":0.14253481498563705},"-","Ω"]
["Thermal coeff at 150C",null,"-",{"$f":"(150+40)*(1.34655999666222-0.667409045393858)/0.828125/(Rds_ON_150*1000)+0.667409045393858/0.828125","v":1.5234944530701631},"-"]
["Minimum off time for regulation",null,"-",80,"-","ns"]
["Maximum Buck duty cycle",null,"-",{"$f":"(1/(fsw*10^3)-t_off_min*10^-9)*fsw*10^3","v":0.82399999999999984},"-"]
["Lx SLEW rate",null,"-",0.9,"-","V/ns"]
[]
["Buck Fet","Vin < 5.5V",{"$f":"1.25*Rds_ON_min40_7V","v":0.11249999999999999},"-",{"$f":"1.1429*Rds_ON_150_7V","v":0.21715100000000001},"Ω"]
[null,null,"-",{"$f":"(Rds_ON_150-Rds_ON_min40)/190","v":5.5079473684210541E-4},"-","Ω/°C"]
[null,"5V ≤ Vin ≤ 7V",{"$f":"1.1667*Rds_ON_min40_7V","v":0.105003},"-",{"$f":"1.0714*Rds_ON_150_7V","v":0.203566},"Ω"]
[null,null,"-",{"$f":"(E13-C13)/190","v":5.1875263157894738E-4},"-","Ω/°C"]
[null,"Vin > 7V",0.09,"-",0.19,"Ω"]
[null,null,"-",{"$f":"(E15-C15)/190","v":5.263157894736842E-4},"-","Ω/°C"]
["VUC",null,0.503,"-",0.32729999999999998,"Ω"]
[null,null,"-",{"$f":"(Rds_ON_VUC_150-Rds_ON_VUC_min40)/190","v":9.2473684210526324E-4},"-","Ω/°C"]
["V5A",null,0.69899999999999995,"-",0.2402,"Ω"]
[null,null,"-",{"$f":"(Rds_ON_V5A_150-Rds_ON_V5A_min40)/190","v":2.4147368421052629E-3},"-","Ω/°C"]
["V5P1",null,0.69899999999999995,"-",0.2402,"Ω"]
[null,null,"-",{"$f":"(Rds_ON_V5P1_150-Rds_ON_V5P1_min40)/190","v":2.4147368421052629E-3},"-","Ω/°C"]
["V5P2",null,0.69899999999999995,"-",0.2402,"Ω"]
[null,null,"-",{"$f":"(Rds_ON_V5P2_150-Rds_ON_V5P2_min40)/190","v":2.4147368421052629E-3},"-","Ω/°C"]
["Adjust Boost Duty Cycle slope "]
["Duty at",3.8,"-",0.6,"-"]
["Duty at",6.5,"-",0.28999999999999998,"-"]
["m",null,"-",{"$f":"(D26-D27)/(B26-B27)","v":-0.1148148148148148},"-"]
["b",null,"-",{"$f":"D26-D28*B26","v":1.0362962962962963},"-"]
[]
[]
["VF, Temp. Coeff.",null,null,-1.2]
["RTHAVG",null,null,120]
["VF, Temp. Coeff.",null,null,-1]
["RTHAVG",null,null,120]
[]
[]
[]
[]
[]
["C_Vripple",null,{"$f":"ROUNDUP(2*MAX(Pdiss!K23:BH23)/(8*Vripple*fsw),0)","v":1}]
["C Istep up",null,{"$f":"IF(Vin_min_transient>Vreg,ROUNDUP(L_buck*I_step^2/(2*V_transient*D_max_IC*(Vin_min_transient-Vreg)),0),ROUNDUP(L_buck*I_step^2/(2*V_transient*D_max_IC*(0.7)),0))","v":{"$error":"#NAME?"}}]
["C Istep down",null,{"$f":"ROUNDUP(L_buck*I_step^2/(2*V_transient*D_max_IC*Vreg),0)","v":1}]
["ESR ="]
["ESL =",null,1.8]
["Co_tot_min",null,{"$f":"Pdiss!B45*Pdiss!B43","v":40}]
[]
["Vripple",null,0.02]
["I Step",null,0.15]
["V transient",null,0.1]
["VIN min for transient",null,{"$f":"Vin_min","v":{"$error":"#NAME?"}}]